{"text_format":"1","workbook":"xlsx","n_sheets":18,"sheets":["Pool de 6","Pool de 6 (2)","Pool de 7","Pool de 8","U12 M","U14 M","U16 M","U12 F","U14 F","U16 F","Tournois 6-7","Médailles Vierge","Tournois 16","Tournois 32","Arbitre","Résultats","Coupe Berthelette","Trophé du Millénaire"],"not_rendered":{"charts":0,"images":0,"macros":0,"external_links":0,"defined_names":10,"comments":0,"pivot_tables":0},"unopened":[],"bounds":{"document_bytes":16777216,"sheet_cells":100000,"rows_first":2000,"rows_last":500,"rows_between":2000,"halvings":0,"cell_chars":16384,"cell_head_chars":4096},"cells_cut":0,"cells_raw":0,"read":"whole","date_system":"1900"}

{"sheet":"Pool de 6","index":0,"n_rows":32,"n_cols":44,"rows_kept":32,"cut":false,"hidden":true,"merged":[[28,3,29,4],[28,5,28,8],[28,12,28,14],[29,5,29,8],[30,3,31,4],[30,5,30,8],[31,5,31,8],[31,24,32,24],[33,24,34,24],[24,3,25,4],[24,5,24,8],[24,12,24,14],[25,5,25,8],[25,12,25,14],[25,24,26,24],[26,3,27,4],[26,5,26,8],[26,12,26,14],[27,5,27,8],[27,12,27,14],[20,14,21,14],[20,15,21,15],[20,16,21,16],[20,17,21,17],[20,18,21,18],[20,37,21,37],[21,5,21,6],[23,3,23,8],[23,11,23,14],[20,4,21,4],[20,5,20,6],[20,7,21,7],[20,8,21,8],[20,9,21,9],[20,10,21,10],[20,11,21,11],[20,12,21,12],[20,13,21,13],[16,16,17,16],[16,17,17,17],[16,18,17,18],[17,5,17,6],[17,30,17,32],[18,4,19,4],[18,5,18,6],[18,7,19,7],[18,8,19,8],[18,9,19,9],[18,10,19,10],[18,11,19,11],[18,12,19,12],[18,13,19,13],[18,14,19,14],[18,15,19,15],[18,16,19,16],[18,17,19,17],[18,18,19,18],[19,5,19,6],[16,4,17,4],[16,5,16,6],[16,7,17,7],[16,8,17,8],[16,9,17,9],[16,10,17,10],[16,11,17,11],[16,12,17,12],[16,13,17,13],[12,14,13,14],[12,15,13,15],[12,10,13,10],[12,11,13,11],[12,12,13,12],[12,13,13,13],[16,14,17,14],[16,15,17,15],[12,16,13,16],[12,17,13,17],[12,18,13,18],[13,5,13,6],[14,4,15,4],[14,5,14,6],[14,7,15,7],[14,8,15,8],[14,9,15,9],[14,10,15,10],[14,11,15,11],[14,12,15,12],[14,13,15,13],[14,14,15,14],[14,15,15,15],[14,16,15,16],[14,17,15,17],[14,18,15,18],[15,5,15,6],[12,4,13,4],[12,5,12,6],[12,7,13,7],[12,8,13,8],[12,9,13,9],[7,13,9,13],[7,14,9,14],[7,15,9,15],[7,16,9,16],[7,17,9,17],[7,18,9,18],[8,1,8,3],[10,4,11,4],[10,5,10,6],[10,7,11,7],[10,8,11,8],[10,9,11,9],[10,10,11,10],[10,11,11,11],[10,12,11,12],[10,13,11,13],[10,14,11,14],[10,15,11,15],[10,16,11,16],[10,17,11,17],[10,18,11,18],[11,5,11,6],[6,1,6,2],[7,1,7,3],[7,4,9,6],[7,7,9,7],[7,8,9,8],[7,9,9,9],[7,10,9,10],[7,11,9,11],[7,12,9,12],[0,1,0,20],[2,6,2,10],[2,11,2,12],[2,13,2,19],[3,8,3,10],[3,11,3,12],[3,13,3,19],[4,6,4,10],[4,14,5,15],[5,5,5,10]]}
[null,{"$f":"#REF!&\" \"&#REF!","v":{"$error":"#REF!"}},null,null,null,null,null,null,null,null,null,null,null,null,null,null,null,null,null,null,null,null,null,null,null,null,"Jaune et +"]
[null,null,null,null,null,null,null,null,null,null,null,null,null,null,null,null,null,null,null,null,null,null,null,null,null,null,"Jaune & Orange"]
[null,null,null,null,null,"Catégorie",{"$f":"CONCATENATE(#REF!)","v":{"$error":"#REF!"}},null,null,null,null,"Date :",null,{"$f":"#REF!","v":{"$error":"#REF!"}},null,null,null,null,null,null,null,null,null,null,null,null,"Vert et plus"]
[null,null,null,null,null,"Poids",null,"à",null,null,null,"Lieu :",null,{"$f":"#REF!","v":{"$error":"#REF!"}},null,null,null,null,null,null,null,null,null,null,null,null,"Marron"]
[null,null,null,null,null,"Grade",null,null,null,null,null,null,null,null,"TAPIS ",null,null,null,null,null,null,null,null,null,null,null,"Marron-Noire"]
[null,null,null,null,null,"© 2000 Club de Judo Saint-Hubert",null,null,null,null,null,null,null,null,null,null,null,null,null,null,null,null,null,null,null,null,"Noire"]
[null,"Pool"]
[null,"Ordre de combats",null,null,"NOMS",null,null,"GR",null,1,2,3,4,5,6,"Victoires","Points","Classement","Pts de Grade"]
[null,"Bassin de"]
[null,null,6]
[1,null,"1-2",null,"1",{"$f":"CONCATENATE((LOOKUP(A11,#REF!,#REF!)),\" \",(LOOKUP(A11,#REF!,#REF!)))","v":{"$error":"#REF!"}},null,{"$f":"CONCATENATE(LOOKUP(A11,#REF!,#REF!))","v":{"$error":"#REF!"}},"1",null,null,null,null,null,null,null,null,null,null,{"$f":"AND(K$11<>\"\",L$11<>\"\",M$11<>\"\",N$11<>\"\",J$13<>\"\",L$13<>\"\",M$13<>\"\",N$13<>\"\",J$15<>\"\",K$15<>\"\",M$15<>\"\",N$15<>\"\",J$17<>\"\",K$17<>\"\",L$17<>\"\",N$17<>\"\",J$19<>\"\",K$19<>\"\",L$19<>\"\",M$19<>\"\")","v":false},null,null,null,null,null,null,null,null,null,null,null,null,null,null,null,null,null,null,null,{"$f":"IF(J11>0,1,0)","v":0},{"$f":"IF(K11>0,1,0)","v":0},{"$f":"IF(L11>0,1,0)","v":0},{"$f":"IF(M11>0,1,0)","v":0},{"$f":"IF(N11>0,1,0)","v":0}]
[null,null,"3-5",null,null,{"$f":"LOOKUP(A11,#REF!,#REF!)","v":{"$error":"#REF!"}}]
[2,null,"4-6",null,"2",{"$f":"CONCATENATE((LOOKUP(A13,#REF!,#REF!)),\" \",(LOOKUP(A13,#REF!,#REF!)))","v":{"$error":"#REF!"}},null,{"$f":"CONCATENATE(LOOKUP(A13,#REF!,#REF!))","v":{"$error":"#REF!"}},"2",null,null,null,null,null,null,null,null,null,null,{"$f":"AND(K$11<>\"\",L$11<>\"\",M$11<>\"\",N$11<>\"\",J$13<>\"\",L$13<>\"\",M$13<>\"\",N$13<>\"\",J$15<>\"\",K$15<>\"\",M$15<>\"\",N$15<>\"\",J$17<>\"\",K$17<>\"\",L$17<>\"\",N$17<>\"\",J$19<>\"\",K$19<>\"\",L$19<>\"\",M$19<>\"\")","v":false},null,null,null,null,null,null,null,null,null,null,null,null,null,null,null,null,null,null,null,{"$f":"IF(J13>0,1,0)","v":0},{"$f":"IF(K13>0,1,0)","v":0},{"$f":"IF(L13>0,1,0)","v":0},{"$f":"IF(M13>0,1,0)","v":0},{"$f":"IF(N13>0,1,0)","v":0}]
[null,null,"1-3",null,null,{"$f":"LOOKUP(A13,#REF!,#REF!)","v":{"$error":"#REF!"}}]
[3,null,"2-6",null,"3",{"$f":"CONCATENATE((LOOKUP(A15,#REF!,#REF!)),\" \",(LOOKUP(A15,#REF!,#REF!)))","v":{"$error":"#REF!"}},null,{"$f":"CONCATENATE(LOOKUP(A15,#REF!,#REF!))","v":{"$error":"#REF!"}},"3",null,null,null,null,null,null,null,null,null,null,{"$f":"AND(K$11<>\"\",L$11<>\"\",M$11<>\"\",N$11<>\"\",J$13<>\"\",L$13<>\"\",M$13<>\"\",N$13<>\"\",J$15<>\"\",K$15<>\"\",M$15<>\"\",N$15<>\"\",J$17<>\"\",K$17<>\"\",L$17<>\"\",N$17<>\"\",J$19<>\"\",K$19<>\"\",L$19<>\"\",M$19<>\"\")","v":false},null,null,null,null,null,null,null,null,null,null,null,null,null,null,null,null,null,null,null,{"$f":"IF(J15>0,1,0)","v":0},{"$f":"IF(K15>0,1,0)","v":0},{"$f":"IF(L15>0,1,0)","v":0},{"$f":"IF(M15>0,1,0)","v":0},{"$f":"IF(N15>0,1,0)","v":0}]
[null,null,"4-5",null,null,{"$f":"LOOKUP(A15,#REF!,#REF!)","v":{"$error":"#REF!"}}]
[4,null,"1-4",null,"4",{"$f":"CONCATENATE((LOOKUP(A17,#REF!,#REF!)),\" \",(LOOKUP(A17,#REF!,#REF!)))","v":{"$error":"#REF!"}},null,{"$f":"CONCATENATE(LOOKUP(A17,#REF!,#REF!))","v":{"$error":"#REF!"}},"4",null,null,null,null,null,null,null,null,null,null,{"$f":"AND(K$11<>\"\",L$11<>\"\",M$11<>\"\",N$11<>\"\",J$13<>\"\",L$13<>\"\",M$13<>\"\",N$13<>\"\",J$15<>\"\",K$15<>\"\",M$15<>\"\",N$15<>\"\",J$17<>\"\",K$17<>\"\",L$17<>\"\",N$17<>\"\",J$19<>\"\",K$19<>\"\",L$19<>\"\",M$19<>\"\")","v":false},null,null,null,null,null,null,null,null,null,null,null,null,null,null,null,null,null,null,null,{"$f":"IF(J17>0,1,0)","v":0},{"$f":"IF(K17>0,1,0)","v":0},{"$f":"IF(L17>0,1,0)","v":0},{"$f":"IF(M17>0,1,0)","v":0},{"$f":"IF(N17>0,1,0)","v":0}]
[null,null,"2-3",null,null,{"$f":"LOOKUP(A17,#REF!,#REF!)","v":{"$error":"#REF!"}}]
[5,null,"5-6",null,"5",{"$f":"CONCATENATE((LOOKUP(A19,#REF!,#REF!)),\" \",(LOOKUP(A19,#REF!,#REF!)))","v":{"$error":"#REF!"}},null,{"$f":"CONCATENATE(LOOKUP(A19,#REF!,#REF!))","v":{"$error":"#REF!"}},"5",null,null,null,null,null,null,null,null,null,null,{"$f":"AND(K$11<>\"\",L$11<>\"\",M$11<>\"\",N$11<>\"\",J$13<>\"\",L$13<>\"\",M$13<>\"\",N$13<>\"\",J$15<>\"\",K$15<>\"\",M$15<>\"\",N$15<>\"\",J$17<>\"\",K$17<>\"\",L$17<>\"\",N$17<>\"\",J$19<>\"\",K$19<>\"\",L$19<>\"\",M$19<>\"\")","v":false},null,null,null,null,null,null,null,null,null,null,null,null,null,null,null,null,null,null,null,{"$f":"IF(J19>0,1,0)","v":0},{"$f":"IF(K19>0,1,0)","v":0},{"$f":"IF(L19>0,1,0)","v":0},{"$f":"IF(M19>0,1,0)","v":0},{"$f":"IF(N19>0,1,0)","v":0}]
[null,null,"1-5",null,null,{"$f":"LOOKUP(A19,#REF!,#REF!)","v":{"$error":"#REF!"}}]
[6,null,"2-4",null,"6",{"$f":"CONCATENATE((LOOKUP(A21,#REF!,#REF!)),\" \",(LOOKUP(A21,#REF!,#REF!)))","v":{"$error":"#REF!"}},null,{"$f":"CONCATENATE(LOOKUP(A21,#REF!,#REF!))","v":{"$error":"#REF!"}},"6",null,null,null,null,null,null,null,null,null,null,null,null,null,null,null,null,null,null,null,null,null,null,null,null,null,null,null,null,null,null,{"$f":"IF(J21>0,1,0)","v":0},{"$f":"IF(K21>0,1,0)","v":0},{"$f":"IF(L21>0,1,0)","v":0},{"$f":"IF(M21>0,1,0)","v":0},{"$f":"IF(N21>0,1,0)","v":0}]
[null,null,"3-6",null,null,{"$f":"LOOKUP(A21,#REF!,#REF!)","v":{"$error":"#REF!"}}]
[]
[null,null,null,"Médaillé(e)s",null,null,null,null,null,null,null,"Gagnant Technique"]
[null,null,null,"Or",null,{"$f":"IF($U$11=1,$F$11,IF($U$13=1,$F$13,IF($U$15=1,$F$15,IF($U$17=1,$F$17,IF($W$23=1,$F$23,\"\")))))","v":""},null,null,null,null,null,10,"Ippon"]
[null,null,null,null,null,{"$f":"IF($U$11=1,$F$12,IF($U$13=1,$F$14,IF($U$15=1,$F$16,IF($U$17=1,$F$18,IF($W$23=1,$F$24,\"\")))))","v":""},null,null,null,null,null,7,"Waza-ari"]
[null,null,null,"Argent",null,{"$f":"IF($U$11=2,$F$11,IF($U$13=2,$F$13,IF($U$15=2,$F$15,IF($U$17=2,$F$17,IF($W$23=2,$F$23,\"\")))))","v":""},null,null,null,null,null,5,"Yuko"]
[null,null,null,null,null,{"$f":"IF($U$11=2,$F$12,IF($U$13=2,$F$14,IF($U$15=2,$F$16,IF($U$17=2,$F$18,IF($W$23=2,$F$24,\"\")))))","v":""},null,null,null,null,null,3,"Koka"]
[null,null,null,"Bronze",null,{"$f":"IF($U$11=3,$F$11,IF($U$13=3,$F$13,IF($U$15=3,$F$15,IF($U$17=3,$F$17,IF($W$23=3,$F$23,\"\")))))","v":""},null,null,null,null,null,1,"Décision"]
[null,null,null,null,null,{"$f":"IF($U$11=3,$F$12,IF($U$13=3,$F$14,IF($U$15=3,$F$16,IF($U$17=3,$F$18,IF($W$23=3,$F$24,\"\")))))","v":""}]
[null,null,null,"Bronze",null,{"$f":"IF($U$11=3,$F$11,IF($U$13=3,$F$13,IF($U$15=3,$F$15,IF($U$17=3,$F$17,IF($W$23=3,$F$23,\"\")))))","v":""}]
[null,null,null,null,null,{"$f":"IF($U$11=3,$F$12,IF($U$13=3,$F$14,IF($U$15=3,$F$16,IF($U$17=3,$F$18,IF($W$23=3,$F$24,\"\")))))","v":""}]

{"sheet":"Pool de 6 (2)","index":1,"n_rows":32,"n_cols":44,"rows_kept":32,"cut":false,"hidden":true,"merged":[[28,3,29,4],[28,5,28,8],[28,12,28,14],[29,5,29,8],[30,3,31,4],[30,5,30,8],[31,5,31,8],[31,24,32,24],[33,24,34,24],[24,3,25,4],[24,5,24,8],[24,12,24,14],[25,5,25,8],[25,12,25,14],[25,24,26,24],[26,3,27,4],[26,5,26,8],[26,12,26,14],[27,5,27,8],[27,12,27,14],[20,14,21,14],[20,15,21,15],[20,16,21,16],[20,17,21,17],[20,18,21,18],[20,37,21,37],[21,5,21,6],[23,3,23,8],[23,11,23,14],[20,4,21,4],[20,5,20,6],[20,7,21,7],[20,8,21,8],[20,9,21,9],[20,10,21,10],[20,11,21,11],[20,12,21,12],[20,13,21,13],[16,16,17,16],[16,17,17,17],[16,18,17,18],[17,5,17,6],[17,30,17,32],[18,4,19,4],[18,5,18,6],[18,7,19,7],[18,8,19,8],[18,9,19,9],[18,10,19,10],[18,11,19,11],[18,12,19,12],[18,13,19,13],[18,14,19,14],[18,15,19,15],[18,16,19,16],[18,17,19,17],[18,18,19,18],[19,5,19,6],[16,4,17,4],[16,5,16,6],[16,7,17,7],[16,8,17,8],[16,9,17,9],[16,10,17,10],[16,11,17,11],[16,12,17,12],[16,13,17,13],[12,14,13,14],[12,15,13,15],[12,10,13,10],[12,11,13,11],[12,12,13,12],[12,13,13,13],[16,14,17,14],[16,15,17,15],[12,16,13,16],[12,17,13,17],[12,18,13,18],[13,5,13,6],[14,4,15,4],[14,5,14,6],[14,7,15,7],[14,8,15,8],[14,9,15,9],[14,10,15,10],[14,11,15,11],[14,12,15,12],[14,13,15,13],[14,14,15,14],[14,15,15,15],[14,16,15,16],[14,17,15,17],[14,18,15,18],[15,5,15,6],[12,4,13,4],[12,5,12,6],[12,7,13,7],[12,8,13,8],[12,9,13,9],[7,13,9,13],[7,14,9,14],[7,15,9,15],[7,16,9,16],[7,17,9,17],[7,18,9,18],[8,1,8,3],[10,4,11,4],[10,5,10,6],[10,7,11,7],[10,8,11,8],[10,9,11,9],[10,10,11,10],[10,11,11,11],[10,12,11,12],[10,13,11,13],[10,14,11,14],[10,15,11,15],[10,16,11,16],[10,17,11,17],[10,18,11,18],[11,5,11,6],[6,1,6,2],[7,1,7,3],[7,4,9,6],[7,7,9,7],[7,8,9,8],[7,9,9,9],[7,10,9,10],[7,11,9,11],[7,12,9,12],[0,1,0,20],[2,6,2,10],[2,11,2,12],[2,13,2,19],[3,8,3,10],[3,11,3,12],[3,13,3,19],[4,6,4,10],[4,14,5,15],[5,5,5,10]]}
[null,{"$f":"#REF!&\" \"&#REF!","v":{"$error":"#REF!"}},null,null,null,null,null,null,null,null,null,null,null,null,null,null,null,null,null,null,null,null,null,null,null,null,"Jaune et +"]
[null,null,null,null,null,null,null,null,null,null,null,null,null,null,null,null,null,null,null,null,null,null,null,null,null,null,"Jaune & Orange"]
[null,null,null,null,null,"Catégorie",{"$f":"CONCATENATE(#REF!)","v":{"$error":"#REF!"}},null,null,null,null,"Date :",null,{"$f":"#REF!","v":{"$error":"#REF!"}},null,null,null,null,null,null,null,null,null,null,null,null,"Vert et plus"]
[null,null,null,null,null,"Poids",null,"à",null,null,null,"Lieu :",null,{"$f":"#REF!","v":{"$error":"#REF!"}},null,null,null,null,null,null,null,null,null,null,null,null,"Marron"]
[null,null,null,null,null,"Grade",null,null,null,null,null,null,null,null,"TAPIS ",null,null,null,null,null,null,null,null,null,null,null,"Marron-Noire"]
[null,null,null,null,null,"© 2000 Club de Judo Saint-Hubert",null,null,null,null,null,null,null,null,null,null,null,null,null,null,null,null,null,null,null,null,"Noire"]
[null,"Pool"]
[null,"Ordre de combats",null,null,"NOMS",null,null,"GR",null,1,2,3,4,5,6,"Victoires","Points","Classement","Pts de Grade"]
[null,"Bassin de"]
[null,null,6]
[1,null,"1-2",null,"1",{"$f":"CONCATENATE((LOOKUP(A11,#REF!,#REF!)),\" \",(LOOKUP(A11,#REF!,#REF!)))","v":{"$error":"#REF!"}},null,{"$f":"CONCATENATE(LOOKUP(A11,#REF!,#REF!))","v":{"$error":"#REF!"}},"1",null,null,null,null,null,null,null,null,null,null,{"$f":"AND(K$11<>\"\",L$11<>\"\",M$11<>\"\",N$11<>\"\",J$13<>\"\",L$13<>\"\",M$13<>\"\",N$13<>\"\",J$15<>\"\",K$15<>\"\",M$15<>\"\",N$15<>\"\",J$17<>\"\",K$17<>\"\",L$17<>\"\",N$17<>\"\",J$19<>\"\",K$19<>\"\",L$19<>\"\",M$19<>\"\")","v":false},null,null,null,null,null,null,null,null,null,null,null,null,null,null,null,null,null,null,null,{"$f":"IF(J11>0,1,0)","v":0},{"$f":"IF(K11>0,1,0)","v":0},{"$f":"IF(L11>0,1,0)","v":0},{"$f":"IF(M11>0,1,0)","v":0},{"$f":"IF(N11>0,1,0)","v":0}]
[null,null,"3-5",null,null,{"$f":"LOOKUP(A11,#REF!,#REF!)","v":{"$error":"#REF!"}}]
[2,null,"4-6",null,"2",{"$f":"CONCATENATE((LOOKUP(A13,#REF!,#REF!)),\" \",(LOOKUP(A13,#REF!,#REF!)))","v":{"$error":"#REF!"}},null,{"$f":"CONCATENATE(LOOKUP(A13,#REF!,#REF!))","v":{"$error":"#REF!"}},"2",null,null,null,null,null,null,null,null,null,null,{"$f":"AND(K$11<>\"\",L$11<>\"\",M$11<>\"\",N$11<>\"\",J$13<>\"\",L$13<>\"\",M$13<>\"\",N$13<>\"\",J$15<>\"\",K$15<>\"\",M$15<>\"\",N$15<>\"\",J$17<>\"\",K$17<>\"\",L$17<>\"\",N$17<>\"\",J$19<>\"\",K$19<>\"\",L$19<>\"\",M$19<>\"\")","v":false},null,null,null,null,null,null,null,null,null,null,null,null,null,null,null,null,null,null,null,{"$f":"IF(J13>0,1,0)","v":0},{"$f":"IF(K13>0,1,0)","v":0},{"$f":"IF(L13>0,1,0)","v":0},{"$f":"IF(M13>0,1,0)","v":0},{"$f":"IF(N13>0,1,0)","v":0}]
[null,null,"1-3",null,null,{"$f":"LOOKUP(A13,#REF!,#REF!)","v":{"$error":"#REF!"}}]
[3,null,"2-6",null,"3",{"$f":"CONCATENATE((LOOKUP(A15,#REF!,#REF!)),\" \",(LOOKUP(A15,#REF!,#REF!)))","v":{"$error":"#REF!"}},null,{"$f":"CONCATENATE(LOOKUP(A15,#REF!,#REF!))","v":{"$error":"#REF!"}},"3",null,null,null,null,null,null,null,null,null,null,{"$f":"AND(K$11<>\"\",L$11<>\"\",M$11<>\"\",N$11<>\"\",J$13<>\"\",L$13<>\"\",M$13<>\"\",N$13<>\"\",J$15<>\"\",K$15<>\"\",M$15<>\"\",N$15<>\"\",J$17<>\"\",K$17<>\"\",L$17<>\"\",N$17<>\"\",J$19<>\"\",K$19<>\"\",L$19<>\"\",M$19<>\"\")","v":false},null,null,null,null,null,null,null,null,null,null,null,null,null,null,null,null,null,null,null,{"$f":"IF(J15>0,1,0)","v":0},{"$f":"IF(K15>0,1,0)","v":0},{"$f":"IF(L15>0,1,0)","v":0},{"$f":"IF(M15>0,1,0)","v":0},{"$f":"IF(N15>0,1,0)","v":0}]
[null,null,"4-5",null,null,{"$f":"LOOKUP(A15,#REF!,#REF!)","v":{"$error":"#REF!"}}]
[4,null,"1-4",null,"4",{"$f":"CONCATENATE((LOOKUP(A17,#REF!,#REF!)),\" \",(LOOKUP(A17,#REF!,#REF!)))","v":{"$error":"#REF!"}},null,{"$f":"CONCATENATE(LOOKUP(A17,#REF!,#REF!))","v":{"$error":"#REF!"}},"4",null,null,null,null,null,null,null,null,null,null,{"$f":"AND(K$11<>\"\",L$11<>\"\",M$11<>\"\",N$11<>\"\",J$13<>\"\",L$13<>\"\",M$13<>\"\",N$13<>\"\",J$15<>\"\",K$15<>\"\",M$15<>\"\",N$15<>\"\",J$17<>\"\",K$17<>\"\",L$17<>\"\",N$17<>\"\",J$19<>\"\",K$19<>\"\",L$19<>\"\",M$19<>\"\")","v":false},null,null,null,null,null,null,null,null,null,null,null,null,null,null,null,null,null,null,null,{"$f":"IF(J17>0,1,0)","v":0},{"$f":"IF(K17>0,1,0)","v":0},{"$f":"IF(L17>0,1,0)","v":0},{"$f":"IF(M17>0,1,0)","v":0},{"$f":"IF(N17>0,1,0)","v":0}]
[null,null,"2-3",null,null,{"$f":"LOOKUP(A17,#REF!,#REF!)","v":{"$error":"#REF!"}}]
[5,null,"5-6",null,"5",{"$f":"CONCATENATE((LOOKUP(A19,#REF!,#REF!)),\" \",(LOOKUP(A19,#REF!,#REF!)))","v":{"$error":"#REF!"}},null,{"$f":"CONCATENATE(LOOKUP(A19,#REF!,#REF!))","v":{"$error":"#REF!"}},"5",null,null,null,null,null,null,null,null,null,null,{"$f":"AND(K$11<>\"\",L$11<>\"\",M$11<>\"\",N$11<>\"\",J$13<>\"\",L$13<>\"\",M$13<>\"\",N$13<>\"\",J$15<>\"\",K$15<>\"\",M$15<>\"\",N$15<>\"\",J$17<>\"\",K$17<>\"\",L$17<>\"\",N$17<>\"\",J$19<>\"\",K$19<>\"\",L$19<>\"\",M$19<>\"\")","v":false},null,null,null,null,null,null,null,null,null,null,null,null,null,null,null,null,null,null,null,{"$f":"IF(J19>0,1,0)","v":0},{"$f":"IF(K19>0,1,0)","v":0},{"$f":"IF(L19>0,1,0)","v":0},{"$f":"IF(M19>0,1,0)","v":0},{"$f":"IF(N19>0,1,0)","v":0}]
[null,null,"1-5",null,null,{"$f":"LOOKUP(A19,#REF!,#REF!)","v":{"$error":"#REF!"}}]
[6,null,"2-4",null,"6",{"$f":"CONCATENATE((LOOKUP(A21,#REF!,#REF!)),\" \",(LOOKUP(A21,#REF!,#REF!)))","v":{"$error":"#REF!"}},null,{"$f":"CONCATENATE(LOOKUP(A21,#REF!,#REF!))","v":{"$error":"#REF!"}},"6",null,null,null,null,null,null,null,null,null,null,null,null,null,null,null,null,null,null,null,null,null,null,null,null,null,null,null,null,null,null,{"$f":"IF(J21>0,1,0)","v":0},{"$f":"IF(K21>0,1,0)","v":0},{"$f":"IF(L21>0,1,0)","v":0},{"$f":"IF(M21>0,1,0)","v":0},{"$f":"IF(N21>0,1,0)","v":0}]
[null,null,"3-6",null,null,{"$f":"LOOKUP(A21,#REF!,#REF!)","v":{"$error":"#REF!"}}]
[]
[null,null,null,"Médaillé(e)s",null,null,null,null,null,null,null,"Gagnant Technique"]
[null,null,null,"Or",null,{"$f":"IF($U$11=1,$F$11,IF($U$13=1,$F$13,IF($U$15=1,$F$15,IF($U$17=1,$F$17,IF($W$23=1,$F$23,\"\")))))","v":""},null,null,null,null,null,10,"Ippon"]
[null,null,null,null,null,{"$f":"IF($U$11=1,$F$12,IF($U$13=1,$F$14,IF($U$15=1,$F$16,IF($U$17=1,$F$18,IF($W$23=1,$F$24,\"\")))))","v":""},null,null,null,null,null,7,"Waza-ari"]
[null,null,null,"Argent",null,{"$f":"IF($U$11=2,$F$11,IF($U$13=2,$F$13,IF($U$15=2,$F$15,IF($U$17=2,$F$17,IF($W$23=2,$F$23,\"\")))))","v":""},null,null,null,null,null,5,"Yuko"]
[null,null,null,null,null,{"$f":"IF($U$11=2,$F$12,IF($U$13=2,$F$14,IF($U$15=2,$F$16,IF($U$17=2,$F$18,IF($W$23=2,$F$24,\"\")))))","v":""},null,null,null,null,null,3,"Koka"]
[null,null,null,"Bronze",null,{"$f":"IF($U$11=3,$F$11,IF($U$13=3,$F$13,IF($U$15=3,$F$15,IF($U$17=3,$F$17,IF($W$23=3,$F$23,\"\")))))","v":""},null,null,null,null,null,1,"Décision"]
[null,null,null,null,null,{"$f":"IF($U$11=3,$F$12,IF($U$13=3,$F$14,IF($U$15=3,$F$16,IF($U$17=3,$F$18,IF($W$23=3,$F$24,\"\")))))","v":""}]
[null,null,null,"Bronze",null,{"$f":"IF($U$11=3,$F$11,IF($U$13=3,$F$13,IF($U$15=3,$F$15,IF($U$17=3,$F$17,IF($W$23=3,$F$23,\"\")))))","v":""}]
[null,null,null,null,null,{"$f":"IF($U$11=3,$F$12,IF($U$13=3,$F$14,IF($U$15=3,$F$16,IF($U$17=3,$F$18,IF($W$23=3,$F$24,\"\")))))","v":""}]

{"sheet":"Pool de 7","index":2,"n_rows":34,"n_cols":46,"rows_kept":34,"cut":false,"hidden":true,"merged":[[32,3,33,4],[32,5,32,7],[33,5,33,7],[35,26,36,26],[37,26,38,26],[24,41,25,41],[25,3,25,7],[25,11,25,14],[26,3,27,4],[26,5,26,7],[26,12,26,14],[27,5,27,7],[27,12,27,14],[28,3,29,4],[28,5,28,7],[28,12,28,14],[29,5,29,7],[29,12,29,14],[29,26,30,26],[30,3,31,4],[30,5,30,7],[30,12,30,14],[31,5,31,7],[20,15,21,15],[20,17,21,17],[20,18,21,18],[20,19,21,19],[20,20,21,20],[21,5,21,6],[22,4,23,4],[22,5,22,6],[22,7,23,7],[22,8,23,8],[22,9,23,9],[22,10,23,10],[22,11,23,11],[22,12,23,12],[22,13,23,13],[22,14,23,14],[22,15,23,15],[22,17,23,17],[22,18,23,18],[22,19,23,19],[22,20,23,20],[23,5,23,6],[20,4,21,4],[20,5,20,6],[20,7,21,7],[20,8,21,8],[20,9,21,9],[20,10,21,10],[20,11,21,11],[20,12,21,12],[20,13,21,13],[16,14,17,14],[16,5,16,6],[16,7,17,7],[16,8,17,8],[16,9,17,9],[16,10,17,10],[16,11,17,11],[16,12,17,12],[16,13,17,13],[20,14,21,14],[16,15,17,15],[16,17,17,17],[16,18,17,18],[16,19,17,19],[16,20,17,20],[17,5,17,6],[17,32,17,34],[18,4,19,4],[18,5,18,6],[18,7,19,7],[18,8,19,8],[18,9,19,9],[18,10,19,10],[18,11,19,11],[18,12,19,12],[18,13,19,13],[18,14,19,14],[18,15,19,15],[18,17,19,17],[18,18,19,18],[18,19,19,19],[18,20,19,20],[19,5,19,6],[16,4,17,4],[12,14,13,14],[12,15,13,15],[12,17,13,17],[12,18,13,18],[12,19,13,19],[12,20,13,20],[13,5,13,6],[14,4,15,4],[14,5,14,6],[14,7,15,7],[14,8,15,8],[14,9,15,9],[14,10,15,10],[14,11,15,11],[14,12,15,12],[14,13,15,13],[14,14,15,14],[14,15,15,15],[14,17,15,17],[14,18,15,18],[14,19,15,19],[14,20,15,20],[15,5,15,6],[12,4,13,4],[12,5,12,6],[12,7,13,7],[12,8,13,8],[12,9,13,9],[12,10,13,10],[12,11,13,11],[12,12,13,12],[12,13,13,13],[7,13,9,13],[7,14,9,14],[7,15,9,15],[7,17,9,17],[7,18,9,18],[7,19,9,19],[7,20,9,20],[8,1,8,3],[10,4,11,4],[10,5,10,6],[10,7,11,7],[10,8,11,8],[10,9,11,9],[10,10,11,10],[10,11,11,11],[10,12,11,12],[10,13,11,13],[10,14,11,14],[10,15,11,15],[10,17,11,17],[10,18,11,18],[10,19,11,19],[10,20,11,20],[11,5,11,6],[6,1,6,2],[7,1,7,3],[7,4,9,6],[7,7,9,7],[7,8,9,8],[7,9,9,9],[7,10,9,10],[7,11,9,11],[7,12,9,12],[0,1,0,20],[2,6,2,10],[2,11,2,12],[2,13,2,19],[3,8,3,10],[3,11,3,12],[3,13,3,19],[4,6,4,10],[4,14,5,15],[5,5,5,10]]}
[null,{"$f":"#REF!&\" \"&#REF!","v":{"$error":"#REF!"}},null,null,null,null,null,null,null,null,null,null,null,null,null,null,null,null,null,null,null,null,null,null,null,null,"Jaune et +"]
[null,null,null,null,null,null,null,null,null,null,null,null,null,null,null,null,null,null,null,null,null,null,null,null,null,null,"Jaune & Orange"]
[null,null,null,null,null,"Catégorie",{"$f":"CONCATENATE(#REF!)","v":{"$error":"#REF!"}},null,null,null,null,"Date :",null,{"$f":"#REF!","v":{"$error":"#REF!"}},null,null,null,null,null,null,null,null,null,null,null,null,"Vert et plus"]
[null,null,null,null,null,"Poids",null,"à",null,null,null,"Lieu :",null,{"$f":"#REF!","v":{"$error":"#REF!"}},null,null,null,null,null,null,null,null,null,null,null,null,"Marron"]
[null,null,null,null,null,"Grade",{"$f":"#REF!","v":{"$error":"#REF!"}},null,null,null,null,null,null,null,"TAPIS ",null,null,null,null,null,null,null,null,null,null,null,"Marron-Noire"]
[null,null,null,null,null,"© 2000 Club de Judo Saint-Hubert",null,null,null,null,null,null,null,null,null,null,null,null,null,null,null,null,null,null,null,null,"Noire"]
[null,"Pool"]
[null,"Ordre de combats",null,null,"NOMS",null,null,"GR",null,1,2,3,4,5,6,7,null,"Victoires","Points","Classement","Pts Grade"]
[null,"Bassin de"]
[null,null,7]
[1,null,"1-3",null,"1",{"$f":"CONCATENATE((LOOKUP(A11,#REF!,#REF!)),\" \",(LOOKUP(A11,#REF!,#REF!)))","v":{"$error":"#REF!"}},null,{"$f":"CONCATENATE(LOOKUP(A11,#REF!,#REF!))","v":{"$error":"#REF!"}},"1",null,null,null,null,null,null,null,null,null,null,null,null,null,null,null,null,null,null,null,null,null,null,null,null,null,null,null,null,null,null,null,null,{"$f":"IF(J11>0,1,0)","v":0},{"$f":"IF(K11>0,1,0)","v":0},{"$f":"IF(L11>0,1,0)","v":0},{"$f":"IF(M11>0,1,0)","v":0},{"$f":"IF(P11>0,1,0)","v":0}]
[null,null,"2-4",null,null,{"$f":"LOOKUP(A11,#REF!,#REF!)","v":{"$error":"#REF!"}}]
[2,null,"5-7",null,"2",{"$f":"CONCATENATE((LOOKUP(A13,#REF!,#REF!)),\" \",(LOOKUP(A13,#REF!,#REF!)))","v":{"$error":"#REF!"}},null,{"$f":"CONCATENATE(LOOKUP(A13,#REF!,#REF!))","v":{"$error":"#REF!"}},"2",null,null,null,null,null,null,null,null,null,null,null,null,null,null,null,null,null,null,null,null,null,null,null,null,null,null,null,null,null,null,null,null,{"$f":"IF(J13>0,1,0)","v":0},{"$f":"IF(K13>0,1,0)","v":0},{"$f":"IF(L13>0,1,0)","v":0},{"$f":"IF(M13>0,1,0)","v":0},{"$f":"IF(P13>0,1,0)","v":0}]
[null,null,"1-5",null,null,{"$f":"LOOKUP(A13,#REF!,#REF!)","v":{"$error":"#REF!"}}]
[3,null,"2-3",null,"3",{"$f":"CONCATENATE((LOOKUP(A15,#REF!,#REF!)),\" \",(LOOKUP(A15,#REF!,#REF!)))","v":{"$error":"#REF!"}},null,{"$f":"CONCATENATE(LOOKUP(A15,#REF!,#REF!))","v":{"$error":"#REF!"}},"3",null,null,null,null,null,null,null,null,null,null,null,null,null,null,null,null,null,null,null,null,null,null,null,null,null,null,null,null,null,null,null,null,{"$f":"IF(J15>0,1,0)","v":0},{"$f":"IF(K15>0,1,0)","v":0},{"$f":"IF(L15>0,1,0)","v":0},{"$f":"IF(M15>0,1,0)","v":0},{"$f":"IF(P15>0,1,0)","v":0}]
[null,null,"6-7",null,null,{"$f":"LOOKUP(A15,#REF!,#REF!)","v":{"$error":"#REF!"}}]
[4,null,"1-2",null,"4",{"$f":"CONCATENATE((LOOKUP(A17,#REF!,#REF!)),\" \",(LOOKUP(A17,#REF!,#REF!)))","v":{"$error":"#REF!"}},null,{"$f":"CONCATENATE(LOOKUP(A17,#REF!,#REF!))","v":{"$error":"#REF!"}},"4",null,null,null,null,null,null,null,null,null,null,null,null,null,null,null,null,null,null,null,null,null,null,null,null,null,null,null,null,null,null,null,null,{"$f":"IF(J17>0,1,0)","v":0},{"$f":"IF(K17>0,1,0)","v":0},{"$f":"IF(L17>0,1,0)","v":0},{"$f":"IF(M17>0,1,0)","v":0},{"$f":"IF(P17>0,1,0)","v":0}]
[null,null,"3-7",null,null,{"$f":"LOOKUP(A17,#REF!,#REF!)","v":{"$error":"#REF!"}}]
[5,null,"4-6",null,"5",{"$f":"CONCATENATE((LOOKUP(A19,#REF!,#REF!)),\" \",(LOOKUP(A19,#REF!,#REF!)))","v":{"$error":"#REF!"}},null,{"$f":"CONCATENATE(LOOKUP(A19,#REF!,#REF!))","v":{"$error":"#REF!"}},"5"]
[null,null,"1-4",null,null,{"$f":"LOOKUP(A19,#REF!,#REF!)","v":{"$error":"#REF!"}}]
[6,null,"2-5",null,"6",{"$f":"CONCATENATE((LOOKUP(A21,#REF!,#REF!)),\" \",(LOOKUP(A21,#REF!,#REF!)))","v":{"$error":"#REF!"}},null,{"$f":"CONCATENATE(LOOKUP(A21,#REF!,#REF!))","v":{"$error":"#REF!"}},"6"]
[null,null,"3-6",null,null,{"$f":"LOOKUP(A21,#REF!,#REF!)","v":{"$error":"#REF!"}}]
[7,null,"4-7",null,"7",{"$f":"CONCATENATE((LOOKUP(A23,#REF!,#REF!)),\" \",(LOOKUP(A23,#REF!,#REF!)))","v":{"$error":"#REF!"}},null,{"$f":"CONCATENATE(LOOKUP(A23,#REF!,#REF!))","v":{"$error":"#REF!"}},"7",null,null,null,null,null,null,null,null,null,null,null,null,null,null,null,null,null,null,null,null,null,null,null,null,null,null,null,null,null,null,null,null,{"$f":"IF(J23>0,1,0)","v":0},{"$f":"IF(K23>0,1,0)","v":0},{"$f":"IF(L23>0,1,0)","v":0},{"$f":"IF(M23>0,1,0)","v":0},{"$f":"IF(P23>0,1,0)","v":0}]
[null,null,"5-6",null,null,{"$f":"LOOKUP(A23,#REF!,#REF!)","v":{"$error":"#REF!"}}]
[]
[null,null,null,"Médaillé(e)s",null,null,null,null,null,null,null,"Gagnant Technique"]
[null,null,null,"Or",null,{"$f":"IF($U$11=1,$F$11,IF($U$13=1,$F$13,IF($U$15=1,$F$15,IF($U$17=1,$F$17,IF($U$23=1,$F$23,\"\")))))","v":""},null,null,null,null,null,10,"Ippon"]
[null,null,null,null,null,{"$f":"IF($U$11=1,$F$12,IF($U$13=1,$F$14,IF($U$15=1,$F$16,IF($U$17=1,$F$18,IF($U$23=1,$F$24,\"\")))))","v":""},null,null,null,null,null,7,"Waza-ari"]
[null,null,null,"Argent",null,{"$f":"IF($U$11=2,$F$11,IF($U$13=2,$F$13,IF($U$15=2,$F$15,IF($U$17=2,$F$17,IF($U$23=2,$F$23,\"\")))))","v":""},null,null,null,null,null,5,"Yuko"]
[null,null,null,null,null,{"$f":"IF($U$11=2,$F$12,IF($U$13=2,$F$14,IF($U$15=2,$F$16,IF($U$17=2,$F$18,IF($U$23=2,$F$24,\"\")))))","v":""},null,null,null,null,null,3,"Koka"]
[null,null,null,"Bronze",null,{"$f":"IF($U$11=3,$F$11,IF($U$13=3,$F$13,IF($U$15=3,$F$15,IF($U$17=3,$F$17,IF($U$23=3,$F$23,\"\")))))","v":""},null,null,null,null,null,1,"Décision"]
[null,null,null,null,null,{"$f":"IF($U$11=3,$F$12,IF($U$13=3,$F$14,IF($U$15=3,$F$16,IF($U$17=3,$F$18,IF($U$23=3,$F$24,\"\")))))","v":""}]
[null,null,null,"Bronze",null,{"$f":"IF($U$11=3,$F$11,IF($U$13=3,$F$13,IF($U$15=3,$F$15,IF($U$17=3,$F$17,IF($U$23=3,$F$23,\"\")))))","v":""}]
[null,null,null,null,null,{"$f":"IF($U$11=3,$F$12,IF($U$13=3,$F$14,IF($U$15=3,$F$16,IF($U$17=3,$F$18,IF($U$23=3,$F$24,\"\")))))","v":""}]

{"sheet":"Pool de 8","index":3,"n_rows":36,"n_cols":49,"rows_kept":36,"cut":false,"hidden":true,"merged":[[34,3,35,4],[34,5,34,7],[35,5,35,7],[37,27,38,27],[39,27,40,27],[26,42,27,42],[27,3,27,7],[27,11,27,14],[28,3,29,4],[28,5,28,7],[28,12,28,14],[29,5,29,7],[29,12,29,14],[30,3,31,4],[30,5,30,7],[30,12,30,14],[31,5,31,7],[31,12,31,14],[31,27,32,27],[32,3,33,4],[32,5,32,7],[32,12,32,14],[33,5,33,7],[24,14,25,14],[24,15,25,15],[24,16,25,16],[24,18,25,18],[24,19,25,19],[24,20,25,20],[24,21,25,21],[24,22,25,22],[24,23,25,23],[24,4,25,4],[24,5,24,6],[24,7,25,7],[24,8,25,8],[24,9,25,9],[24,10,25,10],[24,11,25,11],[24,12,25,12],[24,13,25,13],[25,5,25,6],[22,14,23,14],[22,15,23,15],[22,16,23,16],[22,18,23,18],[22,19,23,19],[22,20,23,20],[22,21,23,21],[22,22,23,22],[22,23,23,23],[22,4,23,4],[22,5,22,6],[22,7,23,7],[22,8,23,8],[22,9,23,9],[22,10,23,10],[22,11,23,11],[22,12,23,12],[22,13,23,13],[23,5,23,6],[20,14,21,14],[20,15,21,15],[20,16,21,16],[20,18,21,18],[20,19,21,19],[20,20,21,20],[20,21,21,21],[20,22,21,22],[20,23,21,23],[20,4,21,4],[20,5,20,6],[20,7,21,7],[20,8,21,8],[20,9,21,9],[20,10,21,10],[20,11,21,11],[20,12,21,12],[20,13,21,13],[21,5,21,6],[17,35,17,37],[18,4,19,4],[18,5,18,6],[18,7,19,7],[18,8,19,8],[18,9,19,9],[18,10,19,10],[18,11,19,11],[18,12,19,12],[18,13,19,13],[18,14,19,14],[18,15,19,15],[18,16,19,16],[18,18,19,18],[18,19,19,19],[18,20,19,20],[18,21,19,21],[18,22,19,22],[18,23,19,23],[19,5,19,6],[16,14,17,14],[16,15,17,15],[16,16,17,16],[16,18,17,18],[16,19,17,19],[16,20,17,20],[16,21,17,21],[16,22,17,22],[16,23,17,23],[16,4,17,4],[16,5,16,6],[16,7,17,7],[16,8,17,8],[16,9,17,9],[16,10,17,10],[16,11,17,11],[16,12,17,12],[16,13,17,13],[17,5,17,6],[14,14,15,14],[14,15,15,15],[14,16,15,16],[14,18,15,18],[14,19,15,19],[14,20,15,20],[14,21,15,21],[14,22,15,22],[14,23,15,23],[14,4,15,4],[14,5,14,6],[14,7,15,7],[14,8,15,8],[14,9,15,9],[14,10,15,10],[14,11,15,11],[14,12,15,12],[14,13,15,13],[15,5,15,6],[12,14,13,14],[12,15,13,15],[12,16,13,16],[12,18,13,18],[12,19,13,19],[12,20,13,20],[12,21,13,21],[12,22,13,22],[12,23,13,23],[12,4,13,4],[12,5,12,6],[12,7,13,7],[12,8,13,8],[12,9,13,9],[12,10,13,10],[12,11,13,11],[12,12,13,12],[12,13,13,13],[13,5,13,6],[7,23,9,23],[8,1,8,3],[9,1,9,3],[10,4,11,4],[10,5,10,6],[10,7,11,7],[10,8,11,8],[10,9,11,9],[10,10,11,10],[10,11,11,11],[10,12,11,12],[10,13,11,13],[10,14,11,14],[10,15,11,15],[10,16,11,16],[10,18,11,18],[10,19,11,19],[10,20,11,20],[10,21,11,21],[10,22,11,22],[10,23,11,23],[11,5,11,6],[7,13,9,13],[7,14,9,14],[7,15,9,15],[7,16,9,16],[7,18,9,18],[7,19,9,19],[7,20,9,20],[7,21,9,21],[7,22,9,22],[6,1,6,2],[7,1,7,3],[7,4,9,6],[7,7,9,7],[7,8,9,8],[7,9,9,9],[7,10,9,10],[7,11,9,11],[7,12,9,12],[0,1,0,20],[2,6,2,10],[2,11,2,12],[2,13,2,19],[3,8,3,10],[3,11,3,12],[3,13,3,19],[4,6,4,10],[4,14,5,15],[5,5,5,10]]}
[null,{"$f":"#REF!&\" \"&#REF!","v":{"$error":"#REF!"}},null,null,null,null,null,null,null,null,null,null,null,null,null,null,null,null,null,null,null,null,null,null,null,null,null,null,null,"Jaune et +"]
[null,null,null,null,null,null,null,null,null,null,null,null,null,null,null,null,null,null,null,null,null,null,null,null,null,null,null,null,null,"Jaune & Orange"]
[null,null,null,null,null,"Catégorie",{"$f":"CONCATENATE(#REF!)","v":{"$error":"#REF!"}},null,null,null,null,"Date :",null,{"$f":"#REF!","v":{"$error":"#REF!"}},null,null,null,null,null,null,null,null,null,null,null,null,null,null,null,"Vert et plus"]
[null,null,null,null,null,"Poids",null,"à",null,null,null,"Lieu :",null,{"$f":"#REF!","v":{"$error":"#REF!"}},null,null,null,null,null,null,null,null,null,null,null,null,null,null,null,"Marron"]
[null,null,null,null,null,"Grade",{"$f":"#REF!","v":{"$error":"#REF!"}},null,null,null,null,null,null,null,"TAPIS ",null,null,null,null,null,null,null,null,null,null,null,null,null,null,"Marron-Noire"]
[null,null,null,null,null,"© 2000 Club de Judo Saint-Hubert",null,null,null,null,null,null,null,null,null,null,null,null,null,null,null,null,null,null,null,null,null,null,null,"Noire"]
[null,"Pool"]
[null,"Ordre de combats",null,null,"NOMS",null,null,"GR",null,1,2,3,4,5,6,7,8,null,"Victoires","Points","Rang ","Rang B","Classement","Pts Grade"]
[null,"Bassin de"]
[null,8]
[1,null,"1-2",null,"1",{"$f":"CONCATENATE((LOOKUP(A11,#REF!,#REF!)),\" \",(LOOKUP(A11,#REF!,#REF!)))","v":{"$error":"#REF!"}},null,{"$f":"CONCATENATE(LOOKUP(A11,#REF!,#REF!))","v":{"$error":"#REF!"}},"1",null,null,null,null,null,null,null,null,null,null,null,null,null,null,null,null,null,null,null,null,null,null,null,null,null,null,null,null,null,null,null,null,null,null,null,{"$f":"IF(J11>0,1,0)","v":0},{"$f":"IF(K11>0,1,0)","v":0},{"$f":"IF(L11>0,1,0)","v":0},{"$f":"IF(M11>0,1,0)","v":0},{"$f":"IF(Q11>0,1,0)","v":0}]
[null,null,"3-6",null,null,{"$f":"LOOKUP(A11,#REF!,#REF!)","v":{"$error":"#REF!"}}]
[2,null,"4-8",null,"2",{"$f":"CONCATENATE((LOOKUP(A13,#REF!,#REF!)),\" \",(LOOKUP(A13,#REF!,#REF!)))","v":{"$error":"#REF!"}},null,{"$f":"CONCATENATE(LOOKUP(A13,#REF!,#REF!))","v":{"$error":"#REF!"}},"2",null,null,null,null,null,null,null,null,null,null,null,null,null,null,null,null,null,null,null,null,null,null,null,null,null,null,null,null,null,null,null,null,null,null,null,{"$f":"IF(J13>0,1,0)","v":0},{"$f":"IF(K13>0,1,0)","v":0},{"$f":"IF(L13>0,1,0)","v":0},{"$f":"IF(M13>0,1,0)","v":0},{"$f":"IF(Q13>0,1,0)","v":0}]
[null,null,"5-7",null,null,{"$f":"LOOKUP(A13,#REF!,#REF!)","v":{"$error":"#REF!"}}]
[3,null,"1-3",null,"3",{"$f":"CONCATENATE((LOOKUP(A15,#REF!,#REF!)),\" \",(LOOKUP(A15,#REF!,#REF!)))","v":{"$error":"#REF!"}},null,{"$f":"CONCATENATE(LOOKUP(A15,#REF!,#REF!))","v":{"$error":"#REF!"}},"3",null,null,null,null,null,null,null,null,null,null,null,null,null,null,null,null,null,null,null,null,null,null,null,null,null,null,null,null,null,null,null,null,null,null,null,{"$f":"IF(J15>0,1,0)","v":0},{"$f":"IF(K15>0,1,0)","v":0},{"$f":"IF(L15>0,1,0)","v":0},{"$f":"IF(M15>0,1,0)","v":0},{"$f":"IF(Q15>0,1,0)","v":0}]
[null,null,"2-5",null,null,{"$f":"LOOKUP(A15,#REF!,#REF!)","v":{"$error":"#REF!"}}]
[4,null,"4-6",null,"4",{"$f":"CONCATENATE((LOOKUP(A17,#REF!,#REF!)),\" \",(LOOKUP(A17,#REF!,#REF!)))","v":{"$error":"#REF!"}},null,{"$f":"CONCATENATE(LOOKUP(A17,#REF!,#REF!))","v":{"$error":"#REF!"}},"4",null,null,null,null,null,null,null,null,null,null,null,null,null,null,null,null,null,null,null,null,null,null,null,null,null,null,null,null,null,null,null,null,null,null,null,{"$f":"IF(J17>0,1,0)","v":0},{"$f":"IF(K17>0,1,0)","v":0},{"$f":"IF(L17>0,1,0)","v":0},{"$f":"IF(M17>0,1,0)","v":0},{"$f":"IF(Q17>0,1,0)","v":0}]
[null,null,"7-8",null,null,{"$f":"LOOKUP(A17,#REF!,#REF!)","v":{"$error":"#REF!"}}]
[5,null,"1-4",null,"5",{"$f":"CONCATENATE((LOOKUP(A19,#REF!,#REF!)),\" \",(LOOKUP(A19,#REF!,#REF!)))","v":{"$error":"#REF!"}},null,{"$f":"CONCATENATE(LOOKUP(A19,#REF!,#REF!))","v":{"$error":"#REF!"}},"5"]
[null,null,"2-3",null,null,{"$f":"LOOKUP(A19,#REF!,#REF!)","v":{"$error":"#REF!"}}]
[6,null,"5-8",null,"6",{"$f":"CONCATENATE((LOOKUP(A21,#REF!,#REF!)),\" \",(LOOKUP(A21,#REF!,#REF!)))","v":{"$error":"#REF!"}},null,{"$f":"CONCATENATE(LOOKUP(A21,#REF!,#REF!))","v":{"$error":"#REF!"}},"6"]
[null,null,"6-7",null,null,{"$f":"LOOKUP(A21,#REF!,#REF!)","v":{"$error":"#REF!"}}]
[7,null,"1-5",null,"7",{"$f":"CONCATENATE((LOOKUP(A23,#REF!,#REF!)),\" \",(LOOKUP(A23,#REF!,#REF!)))","v":{"$error":"#REF!"}},null,{"$f":"CONCATENATE(LOOKUP(A23,#REF!,#REF!))","v":{"$error":"#REF!"}},"7",null,null,null,null,null,null,null,null,null,null,null,null,null,null,null,null,null,null,null,null,null,null,null,null,null,null,null,null,null,null,null,null,null,null,null,{"$f":"IF(J23>0,1,0)","v":0},{"$f":"IF(K23>0,1,0)","v":0},{"$f":"IF(L23>0,1,0)","v":0},{"$f":"IF(M23>0,1,0)","v":0},{"$f":"IF(Q23>0,1,0)","v":0}]
[null,null,"2-4",null,null,{"$f":"LOOKUP(A23,#REF!,#REF!)","v":{"$error":"#REF!"}}]
[8,null,"3-7",null,"8",{"$f":"CONCATENATE((LOOKUP(A25,#REF!,#REF!)),\" \",(LOOKUP(A25,#REF!,#REF!)))","v":{"$error":"#REF!"}},null,{"$f":"CONCATENATE(LOOKUP(A25,#REF!,#REF!))","v":{"$error":"#REF!"}},"8",null,null,null,null,null,null,null,null,null,null,null,null,null,null,null,null,null,null,null,null,null,null,null,null,null,null,null,null,null,null,null,null,null,null,null,{"$f":"IF(J25>0,1,0)","v":0},{"$f":"IF(K25>0,1,0)","v":0},{"$f":"IF(L25>0,1,0)","v":0},{"$f":"IF(M25>0,1,0)","v":0},{"$f":"IF(Q25>0,1,0)","v":0}]
[null,null,"6-8",null,null,{"$f":"LOOKUP(A25,#REF!,#REF!)","v":{"$error":"#REF!"}}]
[]
[null,null,null,"Médaillé(e)s",null,null,null,null,null,null,null,"Gagnant Technique"]
[null,null,null,"Or",null,{"$f":"IF($X$11=1,$F$11,IF($X$13=1,$F$13,IF($X$15=1,$F$15,IF($X$17=1,$F$17,IF($X$25=1,$F$25,\"\")))))","v":""},null,null,null,null,null,10,"Ippon"]
[null,null,null,null,null,{"$f":"IF($X$11=1,$F$12,IF($X$13=1,$F$14,IF($X$15=1,$F$16,IF($X$17=1,$F$18,IF($X$25=1,$F$26,\"\")))))","v":""},null,null,null,null,null,7,"Waza-ari"]
[null,null,null,"Argent",null,{"$f":"IF($X$11=2,$F$11,IF($X$13=2,$F$13,IF($X$15=2,$F$15,IF($X$17=2,$F$17,IF($X$25=2,$F$25,\"\")))))","v":""},null,null,null,null,null,5,"Yuko"]
[null,null,null,null,null,{"$f":"IF($X$11=2,$F$12,IF($X$13=2,$F$14,IF($X$15=2,$F$16,IF($X$17=2,$F$18,IF($X$25=2,$F$26,\"\")))))","v":""},null,null,null,null,null,3,"Koka"]
[null,null,null,"Bronze",null,{"$f":"IF($X$11=3,$F$11,IF($X$13=3,$F$13,IF($X$15=3,$F$15,IF($X$17=3,$F$17,IF($X$25=3,$F$25,\"\")))))","v":""},null,null,null,null,null,1,"Décision"]
[]
[null,null,null,"Bronze",null,{"$f":"IF($X$11=3,$F$11,IF($X$13=3,$F$13,IF($X$15=3,$F$15,IF($X$17=3,$F$17,IF($X$25=3,$F$25,\"\")))))","v":""}]
[null,null,null,null,null,{"$f":"IF($X$11=3,$F$12,IF($X$13=3,$F$14,IF($X$15=3,$F$16,IF($X$17=3,$F$18,IF($X$25=3,$F$26,\"\")))))","v":""}]

{"sheet":"U12 M","index":4,"n_rows":41,"n_cols":10,"rows_kept":41,"cut":false,"hidden":false,"merged":[[3,5,3,6]]}
[]
[null,"Date :","12-04-2026",null,"Catégorie:","U12"]
[null,"Lieu :","Boucherville",null,"Sexe:","Masculin"]
[null,"Événement :","Tournoi  de Zone  2026",null,"Club:",null,null,null,"Nb d'inscrits :",{"$f":"COUNTA(E7:E41)","v":0}]
[]
[null,null,"Nombre","Nom","Prénom","No Affiliation","Grade","Poids"]
[null,null,1]
[null,null,2]
[null,null,3]
[null,null,4]
[null,null,5]
[null,null,6]
[null,null,7]
[null,null,8]
[null,null,9]
[null,null,10]
[null,null,11]
[null,null,12]
[null,null,13]
[null,null,15]
[null,null,16]
[null,null,17]
[null,null,18]
[null,null,19]
[null,null,20]
[null,null,21]
[null,null,24]
[null,null,25]
[null,null,26]
[null,null,28]
[null,null,29]
[null,null,30]
[null,null,31]
[null,null,32]
[null,null,33]
[null,null,34]
[null,null,35]
[null,null,37]
[null,null,38]
[null,null,39]
[null,null,40]

{"sheet":"U14 M","index":5,"n_rows":41,"n_cols":10,"rows_kept":41,"cut":false,"hidden":false,"merged":[[3,5,3,6]]}
[]
[null,"Date :","12-04-2026",null,"Catégorie:","U14"]
[null,"Lieu :","Boucherville",null,"Sexe:","Masculin"]
[null,"Événement :","Tournoi  de Zone  2026",null,"Club:",null,null,null,"Nb d'inscrits :",{"$f":"COUNTA(E7:E41)","v":0}]
[]
[null,null,"Nombre","Nom","Prénom","No Affiliation","Grade","Poids"]
[null,null,1]
[null,null,2]
[null,null,3]
[null,null,4]
[null,null,5]
[null,null,6]
[null,null,7]
[null,null,8]
[null,null,9]
[null,null,10]
[null,null,11]
[null,null,12]
[null,null,13]
[null,null,15]
[null,null,16]
[null,null,17]
[null,null,18]
[null,null,19]
[null,null,20]
[null,null,21]
[null,null,24]
[null,null,25]
[null,null,26]
[null,null,28]
[null,null,29]
[null,null,30]
[null,null,31]
[null,null,32]
[null,null,33]
[null,null,34]
[null,null,35]
[null,null,37]
[null,null,38]
[null,null,39]
[null,null,40]

{"sheet":"U16 M","index":6,"n_rows":41,"n_cols":10,"rows_kept":41,"cut":false,"hidden":false,"merged":[[3,5,3,6]]}
[]
[null,"Date :","12-04-2026",null,"Catégorie:","U16"]
[null,"Lieu :","Boucherville",null,"Sexe:","Masculin"]
[null,"Événement :","Tournoi  de Zone  2026",null,"Club:",null,null,null,"Nb d'inscrits :",{"$f":"COUNTA(E7:E41)","v":0}]
[]
[null,null,"Nombre","Nom","Prénom","No Affiliation","Grade","Poids"]
[null,null,1]
[null,null,2]
[null,null,3]
[null,null,4]
[null,null,5]
[null,null,6]
[null,null,7]
[null,null,8]
[null,null,9]
[null,null,10]
[null,null,11]
[null,null,12]
[null,null,13]
[null,null,15]
[null,null,16]
[null,null,17]
[null,null,18]
[null,null,19]
[null,null,20]
[null,null,21]
[null,null,24]
[null,null,25]
[null,null,26]
[null,null,28]
[null,null,29]
[null,null,30]
[null,null,31]
[null,null,32]
[null,null,33]
[null,null,34]
[null,null,35]
[null,null,37]
[null,null,38]
[null,null,39]
[null,null,40]

{"sheet":"U12 F","index":7,"n_rows":41,"n_cols":10,"rows_kept":41,"cut":false,"hidden":false,"merged":[[3,5,3,6]]}
[]
[null,"Date :","12-04-2026",null,"Catégorie:","U12"]
[null,"Lieu :","Boucherville",null,"Sexe:","Féminin"]
[null,"Événement :","Tournoi  de Zone  2026",null,"Club:",null,null,null,"Nb d'inscrits :",{"$f":"COUNTA(E7:E41)","v":0}]
[]
[null,null,"Nombre","Nom","Prénom","No Affiliation","Grade","Poids"]
[null,null,1]
[null,null,2]
[null,null,3]
[null,null,4]
[null,null,5]
[null,null,6]
[null,null,7]
[null,null,8]
[null,null,9]
[null,null,10]
[null,null,11]
[null,null,12]
[null,null,13]
[null,null,15]
[null,null,16]
[null,null,17]
[null,null,18]
[null,null,19]
[null,null,20]
[null,null,21]
[null,null,24]
[null,null,25]
[null,null,26]
[null,null,28]
[null,null,29]
[null,null,30]
[null,null,31]
[null,null,32]
[null,null,33]
[null,null,34]
[null,null,35]
[null,null,37]
[null,null,38]
[null,null,39]
[null,null,40]

{"sheet":"U14 F","index":8,"n_rows":41,"n_cols":10,"rows_kept":41,"cut":false,"hidden":false,"merged":[[3,5,3,6]]}
[]
[null,"Date :","12-04-2026",null,"Catégorie:","U14"]
[null,"Lieu :","Boucherville",null,"Sexe:","Féminin"]
[null,"Événement :","Tournoi  de Zone  2026",null,"Club:",null,null,null,"Nb d'inscrits :",{"$f":"COUNTA(E7:E41)","v":0}]
[]
[null,null,"Nombre","Nom","Prénom","No Affiliation","Grade","Poids"]
[null,null,1]
[null,null,2]
[null,null,3]
[null,null,4]
[null,null,5]
[null,null,6]
[null,null,7]
[null,null,8]
[null,null,9]
[null,null,10]
[null,null,11]
[null,null,12]
[null,null,13]
[null,null,15]
[null,null,16]
[null,null,17]
[null,null,18]
[null,null,19]
[null,null,20]
[null,null,21]
[null,null,24]
[null,null,25]
[null,null,26]
[null,null,28]
[null,null,29]
[null,null,30]
[null,null,31]
[null,null,32]
[null,null,33]
[null,null,34]
[null,null,35]
[null,null,37]
[null,null,38]
[null,null,39]
[null,null,40]

{"sheet":"U16 F","index":9,"n_rows":41,"n_cols":10,"rows_kept":41,"cut":false,"hidden":false,"merged":[[3,5,3,6]]}
[]
[null,"Date :","12-04-2026",null,"Catégorie:","U16"]
[null,"Lieu :","Boucherville",null,"Sexe:","Féminin"]
[null,"Événement :","Tournoi  de Zone  2026",null,"Club:",null,null,null,"Nb d'inscrits :",{"$f":"COUNTA(E7:E41)","v":0}]
[]
[null,null,"Nombre","Nom","Prénom","No Affiliation","Grade","Poids"]
[null,null,1]
[null,null,2]
[null,null,3]
[null,null,4]
[null,null,5]
[null,null,6]
[null,null,7]
[null,null,8]
[null,null,9]
[null,null,10]
[null,null,11]
[null,null,12]
[null,null,13]
[null,null,15]
[null,null,16]
[null,null,17]
[null,null,18]
[null,null,19]
[null,null,20]
[null,null,21]
[null,null,24]
[null,null,25]
[null,null,26]
[null,null,28]
[null,null,29]
[null,null,30]
[null,null,31]
[null,null,32]
[null,null,33]
[null,null,34]
[null,null,35]
[null,null,37]
[null,null,38]
[null,null,39]
[null,null,40]

{"sheet":"Tournois 6-7","index":10,"n_rows":32,"n_cols":53,"rows_kept":32,"cut":false,"hidden":true,"merged":[[30,17,31,17],[30,18,31,18],[30,46,31,46],[30,47,31,47],[31,4,31,5],[30,7,31,7],[30,8,31,8],[30,9,31,9],[30,10,31,10],[30,11,31,11],[30,12,31,12],[30,14,31,14],[30,15,31,15],[30,16,31,16],[26,18,27,18],[26,46,27,46],[26,47,27,47],[27,4,27,5],[27,34,28,34],[28,3,29,3],[28,4,28,5],[28,7,29,7],[28,8,29,8],[28,9,29,9],[28,10,29,10],[28,11,29,11],[28,12,29,12],[28,14,29,14],[28,15,29,15],[28,16,29,16],[28,17,29,17],[28,18,29,18],[28,46,29,46],[28,47,29,47],[29,4,29,5],[29,34,30,34],[30,3,31,3],[30,4,30,5],[26,8,27,8],[26,9,27,9],[26,10,27,10],[26,11,27,11],[26,12,27,12],[26,14,27,14],[26,15,27,15],[26,16,27,16],[26,17,27,17],[22,47,23,47],[23,4,23,5],[23,34,24,34],[23,39,23,41],[24,3,25,3],[24,4,24,5],[24,7,25,7],[24,8,25,8],[24,9,25,9],[24,10,25,10],[24,11,25,11],[24,12,25,12],[24,14,25,14],[24,15,25,15],[24,16,25,16],[24,17,25,17],[24,18,25,18],[24,46,25,46],[24,47,25,47],[25,4,25,5],[25,34,26,34],[26,3,27,3],[26,4,26,5],[26,7,27,7],[22,10,23,10],[22,11,23,11],[22,12,23,12],[22,14,23,14],[22,15,23,15],[22,16,23,16],[22,17,23,17],[22,18,23,18],[22,46,23,46],[16,46,17,46],[18,46,19,46],[19,0,19,2],[19,3,21,5],[19,6,21,6],[19,7,21,7],[19,8,21,8],[19,9,21,9],[19,10,21,10],[19,11,21,11],[19,12,21,12],[19,14,21,14],[19,15,21,15],[19,16,21,16],[19,17,21,17],[19,18,21,18],[20,0,20,2],[20,46,21,46],[21,34,22,34],[22,3,23,3],[22,4,22,5],[22,7,23,7],[22,8,23,8],[22,9,23,9],[14,3,15,3],[14,4,14,5],[14,7,15,7],[14,8,15,8],[14,9,15,9],[14,10,15,10],[14,11,15,11],[14,12,15,12],[14,14,15,14],[15,4,15,5],[12,3,13,3],[12,4,12,5],[12,7,13,7],[12,8,13,8],[12,9,13,9],[12,10,13,10],[12,11,13,11],[12,12,13,12],[12,14,13,14],[13,4,13,5],[10,16,11,16],[10,17,11,17],[10,18,11,18],[10,26,11,26],[10,30,11,30],[10,46,11,46],[10,47,11,47],[11,4,11,5],[11,20,12,20],[12,15,13,15],[12,16,13,16],[12,17,13,17],[12,18,13,18],[12,23,13,23],[12,46,13,46],[12,47,13,47],[13,20,14,20],[13,39,13,41],[14,15,15,15],[14,16,15,16],[14,17,15,17],[14,18,15,18],[14,46,15,46],[14,47,15,47],[10,4,10,5],[10,7,11,7],[10,8,11,8],[10,9,11,9],[10,10,11,10],[10,11,11,11],[10,12,11,12],[10,14,11,14],[10,15,11,15],[6,46,7,46],[6,47,7,47],[7,4,7,5],[7,20,8,20],[7,32,7,33],[8,3,9,3],[8,4,8,5],[8,7,9,7],[8,8,9,8],[8,9,9,9],[8,10,9,10],[8,11,9,11],[8,12,9,12],[8,14,9,14],[8,15,9,15],[8,16,9,16],[8,17,9,17],[8,18,9,18],[8,23,9,23],[8,46,9,46],[8,47,9,47],[9,4,9,5],[9,20,10,20],[10,3,11,3],[6,9,7,9],[6,10,7,10],[6,11,7,11],[6,12,7,12],[3,9,5,9],[3,10,5,10],[3,11,5,11],[3,12,5,12],[3,14,5,14],[3,0,3,2],[3,3,5,5],[3,6,5,6],[3,7,5,7],[3,8,5,8],[4,0,4,2],[6,3,7,3],[6,4,6,5],[6,7,7,7],[6,8,7,8],[3,15,5,15],[3,16,5,16],[3,17,5,17],[3,18,5,18],[6,14,7,14],[6,15,7,15],[6,16,7,16],[6,17,7,17],[6,18,7,18]]}
[null,null,null,null,"Catégorie",{"$f":"#REF!","v":{"$error":"#REF!"}}]
[null,null,null,null,"Poid",{"$f":"#REF!","v":{"$error":"#REF!"}},null,"Grade","J-V"]
["A"]
["Ordre de combats",null,null,"NOMS",null,null,"GR",null,1,2,3,4,5,null,"Victoires","Points","Rang ","Rang B","Classement"]
["Bassin de",null,null,null,null,null,null,null,null,null,null,null,null,null,null,null,null,null,null,null,null,null,null,null,null,null,null,null,null,null,null,null,null,null,null,null,null,"J-V"]
[3,4,5,null,null,null,null,null,null,null,null,null,null,null,null,null,null,null,null,null,null,null,null,null,null,null,null,null,null,null,null,null,null,null,null,null,null,"V +"]
["1-2","1-2","1-2","1",{"$f":"CONCATENATE((LOOKUP(1,#REF!,#REF!)),\" \",(LOOKUP(1,#REF!,#REF!)))","v":{"$error":"#REF!"}},null,{"$f":"LOOKUP(1,#REF!,#REF!)","v":{"$error":"#REF!"}},"1",null,10,0,10,10,null,{"$f":"SUM(AW7:BA7)","v":3},{"$f":"J7+K7+L7+M7","v":30},{"$f":"RANK($O$7,$O7:$O$16)","v":1},{"$f":"RANK(AU7,AU7:AU16)","v":1},{"$f":"AS7","v":1},null,"C #","Noms","Gagnant","C #","\"B\"","Gagnant","C #","\"C\"","Gagnant",null,"1er",null,null,null,null,null,null,null,null,{"$f":"IF($Q7=1,1,\"\")","v":1},{"$f":"IF($Q7=5,5,\"\")","v":""},{"$f":"IF($R7=3,2,\"\")","v":""},{"$f":"IF($R7=4,3,\"\")","v":""},{"$f":"IF($R7=5,4,\"\")","v":""},{"$f":"SUM(AN7:AR7)","v":1},null,{"$f":"IF(Q7=2,P7,99)","v":99},{"$f":"Q7+R7","v":2},{"$f":"IF(I7>0,1,0)","v":0},{"$f":"IF(J7>0,1,0)","v":1},{"$f":"IF(K7>0,1,0)","v":0},{"$f":"IF(L7>0,1,0)","v":1},{"$f":"IF(M7>0,1,0)","v":1}]
[null,"3-4","3-4",null,{"$f":"LOOKUP(1,#REF!,#REF!)","v":{"$error":"#REF!"}},null,{"$f":"LOOKUP(1,#REF!,#REF!)","v":{"$error":"#REF!"}},null,null,null,null,null,null,null,null,null,null,null,null,null,1,{"$f":"CONCATENATE((LOOKUP(S8,#REF!,#REF!)),\" \",(LOOKUP(S8,#REF!,#REF!)))","v":{"$error":"#REF!"}},7,null,null,null,null,null,null,null,null,null,"Classement",null,null,null,null,null,null,{"$f":"IF($Q9=1,1,\"\")","v":1},{"$f":"IF($Q9=5,5,\"\")","v":""},{"$f":"IF($R9=3,2,\"\")","v":""},{"$f":"IF($R9=4,3,\"\")","v":""},{"$f":"IF($R9=5,4,\"\")","v":""},{"$f":"SUM(AN8:AR8)","v":1}]
[null,null,"1-5","2",{"$f":"CONCATENATE((LOOKUP(2,#REF!,#REF!)),\" \",(LOOKUP(2,#REF!,#REF!)))","v":{"$error":"#REF!"}},null,{"$f":"LOOKUP(2,#REF!,#REF!)","v":{"$error":"#REF!"}},"2",0,null,5,7,7,null,{"$f":"SUM(AW9:BA9)","v":3},{"$f":"I9+K9+L9+M9","v":19},{"$f":"RANK($O$9,$O7:$O$16)","v":1},{"$f":"RANK(AU9,AU7:AU16)","v":1},{"$f":"AS8","v":1},null,null,{"$f":"CONCATENATE((LOOKUP(S9,#REF!,#REF!)),\" \",(LOOKUP(S9,#REF!,#REF!)))","v":{"$error":"#REF!"}},null,5,{"$f":"IF(W8>0,V8,IF(W9>0,V9,))","v":{"$error":"#REF!"}},null,null,null,null,null,null,null,"Or",{"$f":"AE11","v":{"$error":"#REF!"}},null,null,null,null,null,{"$f":"IF($Q11=1,1,\"\")","v":""},{"$f":"IF($Q11=5,5,\"\")","v":""},{"$f":"IF($R11=3,2,\"\")","v":""},{"$f":"IF($R11=4,3,\"\")","v":""},{"$f":"IF($R11=5,4,\"\")","v":""},{"$f":"SUM(AN9:AR9)","v":0},null,{"$f":"IF(Q9=2,P9,99)","v":99},{"$f":"Q9+R9","v":2},{"$f":"IF(I9>0,1,0)","v":0},{"$f":"IF(J9>0,1,0)","v":0},{"$f":"IF(K9>0,1,0)","v":1},{"$f":"IF(L9>0,1,0)","v":1},{"$f":"IF(M9>0,1,0)","v":1}]
["2-3","1-3","2-3",null,{"$f":"LOOKUP(2,#REF!,#REF!)","v":{"$error":"#REF!"}},null,{"$f":"LOOKUP(2,#REF!,#REF!)","v":{"$error":"#REF!"}},null,null,null,null,null,null,null,null,null,null,null,null,null,2,{"$f":"CONCATENATE((LOOKUP(S10,#REF!,#REF!)),\" \",(LOOKUP(S10,#REF!,#REF!)))","v":{"$error":"#REF!"}},5,null,{"$f":"IF(W10>0,V10,IF(W11>0,V11,))","v":{"$error":"#REF!"}},7,null,null,null,null,null,null,"Argent",{"$f":"IF(AC12>0,AB11,IF(AC11>0,AB12,))","v":{"$error":"#REF!"}},null,null,null,null,null,{"$f":"IF($Q13=1,1,\"\")","v":""},{"$f":"IF($Q13=5,5,\"\")","v":""},{"$f":"IF($R13=3,2,\"\")","v":""},{"$f":"IF($R13=4,3,\"\")","v":""},{"$f":"IF($R13=5,4,\"\")","v":""},{"$f":"SUM(AN10:AR10)","v":0}]
[null,"2-4","4-5","3",{"$f":"CONCATENATE((LOOKUP(3,#REF!,#REF!)),\" \",(LOOKUP(3,#REF!,#REF!)))","v":{"$error":"#REF!"}},null,{"$f":"LOOKUP(3,#REF!,#REF!)","v":{"$error":"#REF!"}},"3",10,0,null,0,5,null,{"$f":"SUM(AW11:BA11)","v":2},{"$f":"I11+J11+L11+M11","v":15},{"$f":"RANK($O$11,$O7:$O$16)","v":3},{"$f":"RANK(AU11,AU7:AU16)","v":1},{"$f":"AS9","v":0},null,null,{"$f":"CONCATENATE((LOOKUP(S11,#REF!,#REF!)),\" \",(LOOKUP(S11,#REF!,#REF!)))","v":{"$error":"#REF!"}},null,null,null,null,12,{"$f":"IF(Z9>0,Y9,IF(Z10>0,Y10,))","v":{"$error":"#REF!"}},null,null,{"$f":"IF(AC11>0,AB11,IF(AC12>0,AB12,))","v":{"$error":"#REF!"}},null,"Bronze",{"$f":"AB20","v":0},null,null,null,null,null,{"$f":"IF($Q15=1,1,\"\")","v":""},{"$f":"IF($Q15=5,5,\"\")","v":""},{"$f":"IF($R15=3,2,\"\")","v":""},{"$f":"IF($R15=4,3,\"\")","v":""},{"$f":"IF($R15=5,4,\"\")","v":""},{"$f":"SUM(AN11:AR11)","v":0},null,{"$f":"IF(Q11=2,P11,99)","v":99},{"$f":"Q11+R11","v":4},{"$f":"IF(I11>0,1,0)","v":1},{"$f":"IF(J11>0,1,0)","v":0},{"$f":"IF(K11>0,1,0)","v":0},{"$f":"IF(L11>0,1,0)","v":0},{"$f":"IF(M11>0,1,0)","v":1}]
[null,null,"1-3",null,{"$f":"LOOKUP(3,#REF!,#REF!)","v":{"$error":"#REF!"}},null,{"$f":"LOOKUP(3,#REF!,#REF!)","v":{"$error":"#REF!"}},null,null,null,null,null,null,null,null,null,null,null,null,null,3,{"$f":"CONCATENATE((LOOKUP(S12,#REF!,#REF!)),\" \",(LOOKUP(S12,#REF!,#REF!)))","v":{"$error":"#REF!"}},7,null,null,null,null,{"$f":"IF(Z13>0,Y13,IF(Z14>0,Y14,))","v":{"$error":"#REF!"}},10,null,null,null,"Bronze",{"$f":"AB21","v":0}]
["1-3","1-4","2-5","4",{"$f":"CONCATENATE((LOOKUP(4,#REF!,#REF!)),\" \",(LOOKUP(4,#REF!,#REF!)))","v":{"$error":"#REF!"}},null,{"$f":"LOOKUP(4,#REF!,#REF!)","v":{"$error":"#REF!"}},"4",0,0,1,null,0,null,{"$f":"SUM(AW13:BA13)","v":1},{"$f":"I13+J13+K13+M13","v":1},{"$f":"RANK($O$13,$O7:$O$16)","v":4},{"$f":"RANK(AU13,AU7:AU16)","v":1},{"$f":"AS10","v":0},null,null,{"$f":"CONCATENATE((LOOKUP(S13,#REF!,#REF!)),\" \",(LOOKUP(S13,#REF!,#REF!)))","v":{"$error":"#REF!"}},null,6,{"$f":"IF(W12>0,V12,IF(W13>0,V13,))","v":{"$error":"#REF!"}},null,null,null,null,null,null,null,null,null,null,null,null,null,null,null,null,null,null,null,null,null,{"$f":"IF(Q13=2,P13,99)","v":99},{"$f":"Q13+R13","v":5},{"$f":"IF(I13>0,1,0)","v":0},{"$f":"IF(J13>0,1,0)","v":0},{"$f":"IF(K13>0,1,0)","v":1},{"$f":"IF(L13>0,1,0)","v":0},{"$f":"IF(M13>0,1,0)","v":0}]
[null,"2-3","1-4",null,{"$f":"LOOKUP(4,#REF!,#REF!)","v":{"$error":"#REF!"}},null,{"$f":"LOOKUP(4,#REF!,#REF!)","v":{"$error":"#REF!"}},null,null,null,null,null,null,null,null,null,null,null,null,null,4,{"$f":"CONCATENATE((LOOKUP(S14,#REF!,#REF!)),\" \",(LOOKUP(S14,#REF!,#REF!)))","v":{"$error":"#REF!"}},"-",null,{"$f":"IF(W14>0,V14,IF(W15>0,V15,))","v":{"$error":"#REF!"}},3,null,null,null,null,null,null,null,null,null,null,null,null,null,{"$f":"CONCATENATE(AS6,\" \",AT6)","v":" "}]
[null,null,"3-5","5",{"$f":"CONCATENATE((LOOKUP(5,#REF!,#REF!)),\" \",(LOOKUP(5,#REF!,#REF!)))","v":{"$error":"#REF!"}},null,{"$f":"LOOKUP(5,#REF!,#REF!)","v":{"$error":"#REF!"}},"5",0,0,0,10,null,null,{"$f":"SUM(AW15:BA15)","v":1},{"$f":"I15+J15+K15+L15","v":10},{"$f":"RANK($O$15,$O7:$O$16)","v":4},{"$f":"RANK(AU15,AU7:AU16)","v":1},{"$f":"AS11","v":0},null,null,{"$f":"CONCATENATE((LOOKUP(S15,#REF!,#REF!)),\" \",(LOOKUP(S15,#REF!,#REF!)))","v":{"$error":"#REF!"}},null,null,null,null,null,null,null,null,null,null,null,null,null,null,null,null,null,null,null,null,null,null,null,null,{"$f":"IF(Q15=2,P15,99)","v":99},{"$f":"Q15+R15","v":5},{"$f":"IF(I15>0,1,0)","v":0},{"$f":"IF(J15>0,1,0)","v":0},{"$f":"IF(K15>0,1,0)","v":0},{"$f":"IF(L15>0,1,0)","v":1},{"$f":"IF(M15>0,1,0)","v":0}]
[null,null,"2-4",null,{"$f":"LOOKUP(5,#REF!,#REF!)","v":{"$error":"#REF!"}},null,{"$f":"LOOKUP(5,#REF!,#REF!)","v":{"$error":"#REF!"}}]
[null,null,null,null,"Âge:",{"$f":"#REF!","v":{"$error":"#REF!"}}]
[null,null,null,null,"Catégorie:",{"$f":"#REF!","v":{"$error":"#REF!"}}]
["B"]
["Ordre de combats",null,null,"NOMS",null,null,"GR",null,1,2,3,4,5,null,"Victoires","Points","Rang","Rang B","Classement"]
["Bassin de"]
[3,4,5]
["1-2","1-2","1-2","1",{"$f":"CONCATENATE((LOOKUP(6,#REF!,#REF!)),\" \",(LOOKUP(6,#REF!,#REF!)))","v":{"$error":"#REF!"}},null,{"$f":"LOOKUP(6,#REF!,#REF!)","v":{"$error":"#REF!"}},"1",null,5,null,null,null,null,{"$f":"SUM(AW24:BA24)","v":1},{"$f":"J23+K23+L23+M23","v":5},{"$f":"RANK($O$7,$O$7:$O32)","v":1},{"$f":"RANK(AU23,AU23:AU32)","v":1},{"$f":"AS27","v":1},null,null,null,null,null,null,null,null,null,null,null,null,null,null,null,null,null,null,null,null,null,null,null,null,null,null,null,{"$f":"IF(Q23=2,P23,99)","v":99}]
[null,"3-4","3-4",null,{"$f":"LOOKUP(6,#REF!,#REF!)","v":{"$error":"#REF!"}},null,null,null,null,null,null,null,null,null,null,null,null,null,null,null,null,null,null,null,null,null,null,null,null,null,null,null,null,null,null,null,null,null,null,{"$f":"CONCATENATE(AS16,\" \",AT16)","v":" "},null,null,null,null,null,null,null,null,{"$f":"IF(I23>0,1,0)","v":0},{"$f":"IF(J23>0,1,0)","v":1},{"$f":"IF(K23>0,1,0)","v":0},{"$f":"IF(L23>0,1,0)","v":0},{"$f":"IF(M23>0,1,0)","v":0}]
[null,null,"1-5","2",{"$f":"CONCATENATE((LOOKUP(7,#REF!,#REF!)),\" \",(LOOKUP(7,#REF!,#REF!)))","v":{"$error":"#REF!"}},null,{"$f":"LOOKUP(7,#REF!,#REF!)","v":{"$error":"#REF!"}},"2",null,null,3,null,null,null,{"$f":"SUM(AW26:BA26)","v":1},{"$f":"I25+K25+L25+M25","v":3},{"$f":"RANK($O$25,$O$7:$O32)","v":4},{"$f":"RANK(AU25,AU23:AU32)","v":1},{"$f":"AS28","v":0},null,null,null,null,null,null,null,null,null,null,null,null,null,null,null,null,null,null,null,null,null,null,null,null,null,null,null,{"$f":"IF(Q25=2,P25,99)","v":99}]
["2-3","1-3","2-3",null,{"$f":"LOOKUP(7,#REF!,#REF!)","v":{"$error":"#REF!"}},null,null,null,null,null,null,null,null,null,null,null,null,null,null,null,null,null,null,null,null,null,null,null,null,null,null,null,null,null,null,null,null,null,null,null,null,null,null,null,null,null,null,null,{"$f":"IF(I25>0,1,0)","v":0},{"$f":"IF(J25>0,1,0)","v":0},{"$f":"IF(K25>0,1,0)","v":1},{"$f":"IF(L25>0,1,0)","v":0},{"$f":"IF(M25>0,1,0)","v":0}]
[null,"2-4","4-5","3",{"$f":"CONCATENATE((LOOKUP(8,#REF!,#REF!)),\" \",(LOOKUP(8,#REF!,#REF!)))","v":{"$error":"#REF!"}},null,{"$f":"LOOKUP(8,#REF!,#REF!)","v":{"$error":"#REF!"}},"3",null,null,null,1,null,null,{"$f":"SUM(AW28:BA28)","v":1},{"$f":"I27+J27+L27+M27","v":1},{"$f":"RANK($O$27,$O$7:$O32)","v":4},{"$f":"RANK(AU27,AU23:AU32)","v":1},{"$f":"AS29","v":0},null,null,null,null,null,null,null,null,null,null,null,null,null,null,null,null,null,null,null,null,{"$f":"IF($Q23=1,1,\"\")","v":1},{"$f":"IF($Q23=5,5,\"\")","v":""},{"$f":"IF($R23=3,2,\"\")","v":""},{"$f":"IF($R23=4,3,\"\")","v":""},{"$f":"IF($R23=5,4,\"\")","v":""},{"$f":"SUM(AN27:AR27)","v":1},null,{"$f":"IF(Q27=2,P27,99)","v":99}]
[null,null,"1-3",null,{"$f":"LOOKUP(8,#REF!,#REF!)","v":{"$error":"#REF!"}},null,null,null,null,null,null,null,null,null,null,null,null,null,null,null,null,null,null,null,null,null,null,null,null,null,null,null,null,null,null,null,null,null,null,{"$f":"IF($Q25=1,1,\"\")","v":""},{"$f":"IF($Q25=5,5,\"\")","v":""},{"$f":"IF($R25=3,2,\"\")","v":""},{"$f":"IF($R25=4,3,\"\")","v":""},{"$f":"IF($R25=5,4,\"\")","v":""},{"$f":"SUM(AN28:AR28)","v":0},null,null,null,{"$f":"IF(I27>0,1,0)","v":0},{"$f":"IF(J27>0,1,0)","v":0},{"$f":"IF(K27>0,1,0)","v":0},{"$f":"IF(L27>0,1,0)","v":1},{"$f":"IF(M27>0,1,0)","v":0}]
["1-3","1-4","2-5","4",{"$f":"CONCATENATE((LOOKUP(9,#REF!,#REF!)),\" \",(LOOKUP(9,#REF!,#REF!)))","v":{"$error":"#REF!"}},null,{"$f":"LOOKUP(9,#REF!,#REF!)","v":{"$error":"#REF!"}},"4",null,null,null,null,10,null,{"$f":"SUM(AW30:BA30)","v":1},{"$f":"I29+J29+K29+M29","v":10},{"$f":"RANK($O$29,$O$7:$O32)","v":4},{"$f":"RANK(AU29,AU23:AU32)","v":1},{"$f":"AS30","v":0},null,null,null,null,null,null,null,null,null,null,null,null,null,null,null,null,null,null,null,null,{"$f":"IF($Q27=1,1,\"\")","v":""},{"$f":"IF($Q27=5,5,\"\")","v":""},{"$f":"IF($R27=3,2,\"\")","v":""},{"$f":"IF($R27=4,3,\"\")","v":""},{"$f":"IF($R27=5,4,\"\")","v":""},{"$f":"SUM(AN29:AR29)","v":0},null,{"$f":"IF(Q29=2,P29,99)","v":99}]
[null,"2-3","1-4",null,{"$f":"LOOKUP(9,#REF!,#REF!)","v":{"$error":"#REF!"}},null,null,null,null,null,null,null,null,null,null,null,null,null,null,null,null,null,null,null,null,null,null,null,null,null,null,null,null,null,null,null,null,null,null,{"$f":"IF($Q29=1,1,\"\")","v":""},{"$f":"IF($Q29=5,5,\"\")","v":""},{"$f":"IF($R29=3,2,\"\")","v":""},{"$f":"IF($R29=4,3,\"\")","v":""},{"$f":"IF($R29=5,4,\"\")","v":""},{"$f":"SUM(AN30:AR30)","v":0},null,null,null,{"$f":"IF(I29>0,1,0)","v":0},{"$f":"IF(J29>0,1,0)","v":0},{"$f":"IF(K29>0,1,0)","v":0},{"$f":"IF(L29>0,1,0)","v":0},{"$f":"IF(M29>0,1,0)","v":1}]
[null,null,"3-5","5",{"$f":"CONCATENATE((LOOKUP(10,#REF!,#REF!)),\" \",(LOOKUP(10,#REF!,#REF!)))","v":{"$error":"#REF!"}},null,{"$f":"LOOKUP(10,#REF!,#REF!)","v":{"$error":"#REF!"}},"5",null,null,null,null,null,null,{"$f":"SUM(AW32:BA32)","v":0},{"$f":"I31+J31+K31+L31","v":0},{"$f":"RANK($O$31,$O$7:$O32)","v":10},{"$f":"RANK(AU31,AU23:AU32)","v":1},{"$f":"AS31","v":0},null,null,null,null,null,null,null,null,null,null,null,null,null,null,null,null,null,null,null,null,{"$f":"IF($Q31=1,1,\"\")","v":""},{"$f":"IF($Q31=5,5,\"\")","v":""},{"$f":"IF($R31=3,2,\"\")","v":""},{"$f":"IF($R31=4,3,\"\")","v":""},{"$f":"IF($R31=5,4,\"\")","v":""},{"$f":"SUM(AN31:AR31)","v":0},null,{"$f":"IF(Q31=2,P31,99)","v":99}]
[null,null,"2-4",null,{"$f":"LOOKUP(10,#REF!,#REF!)","v":{"$error":"#REF!"}},null,null,null,null,null,null,null,null,null,null,null,null,null,null,null,null,null,null,null,null,null,null,null,null,null,null,null,null,null,null,null,null,null,null,null,null,null,null,null,null,null,null,null,{"$f":"IF(I31>0,1,0)","v":0},{"$f":"IF(J31>0,1,0)","v":0},{"$f":"IF(K31>0,1,0)","v":0},{"$f":"IF(L31>0,1,0)","v":0},{"$f":"IF(M31>0,1,0)","v":0}]

{"sheet":"Médailles Vierge","index":11,"n_rows":55,"n_cols":14,"rows_kept":55,"cut":false,"hidden":true,"merged":[]}
["Cat.","Médaille","Récipiendaire","Dojo",null,"Pool","Médaille","Récipiendaire","Dojo",null,"Pool","Médaille","Récipiendaire","Dojo"]
[]
[]
[]
[]
[]
["Pool","Médaille","Récipiendaire","Dojo",null,"Pool","Médaille","Récipiendaire","Dojo",null,"Pool","Médaille","Récipiendaire","Dojo"]
[]
[]
[]
[]
[]
["Pool","Médaille","Récipiendaire","Dojo",null,"Pool","Médaille","Récipiendaire","Dojo",null,"Pool","Médaille","Récipiendaire","Dojo"]
[]
[]
[]
[]
[]
["Pool","Médaille","Récipiendaire","Dojo",null,"Pool","Médaille","Récipiendaire","Dojo",null,"Pool","Médaille","Récipiendaire","Dojo"]
[]
[]
[]
[]
[]
["Pool","Médaille","Récipiendaire","Dojo",null,"Pool","Médaille","Récipiendaire","Dojo",null,"Pool","Médaille","Récipiendaire","Dojo"]
[]
[]
[]
[]
[]
["Pool","Médaille","Récipiendaire","Dojo",null,"Pool","Médaille","Récipiendaire","Dojo",null,"Pool","Médaille","Récipiendaire","Dojo"]
[]
[]
[]
[]
[]
["Pool","Médaille","Récipiendaire","Dojo",null,"Pool","Médaille","Récipiendaire","Dojo",null,"Pool","Médaille","Récipiendaire","Dojo"]
[]
[]
[]
[]
[]
["Pool","Médaille","Récipiendaire","Dojo",null,"Pool","Médaille","Récipiendaire","Dojo",null,"Pool","Médaille","Récipiendaire","Dojo"]
[]
[]
[]
[]
[]
["Pool","Médaille","Récipiendaire","Dojo",null,"Pool","Médaille","Récipiendaire","Dojo",null,"Pool","Médaille","Récipiendaire","Dojo"]
[]
[]
[]
[]
[]
["Pool","Médaille","Récipiendaire","Dojo",null,"Pool","Médaille","Récipiendaire","Dojo",null,"Pool","Médaille","Récipiendaire","Dojo"]

{"sheet":"Tournois 16","index":12,"n_rows":52,"n_cols":19,"rows_kept":52,"cut":false,"hidden":true,"merged":[[44,14,45,14],[44,18,45,18],[46,2,47,2],[46,5,47,5],[48,8,49,8],[48,11,49,11],[37,0,52,1],[38,2,39,2],[38,5,39,5],[40,8,41,8],[40,11,41,11],[42,2,43,2],[42,5,43,5],[44,11,45,11],[50,2,51,2],[50,5,51,5],[31,4,32,4],[33,0,34,0],[33,1,34,1],[33,4,34,4],[36,0,36,1],[23,4,24,4],[25,0,26,0],[25,1,26,1],[25,4,26,4],[26,8,27,8],[27,0,28,0],[27,1,28,1],[27,2,30,2],[27,4,28,4],[29,0,30,0],[29,1,30,1],[29,4,30,4],[30,5,31,5],[31,0,32,0],[31,1,32,1],[31,2,34,2],[15,4,16,4],[17,0,18,0],[17,1,18,1],[17,4,18,4],[18,11,19,11],[19,0,20,0],[19,1,20,1],[19,2,22,2],[19,4,20,4],[21,0,22,0],[21,1,22,1],[21,4,22,4],[22,5,23,5],[23,0,24,0],[23,1,24,1],[23,2,26,2],[9,0,10,0],[9,1,10,1],[9,4,10,4],[9,17,10,17],[10,8,11,8],[11,0,12,0],[11,1,12,1],[11,2,14,2],[11,4,12,4],[13,0,14,0],[13,1,14,1],[13,4,14,4],[14,5,15,5],[15,0,16,0],[15,1,16,1],[15,2,18,2],[2,17,2,18],[3,0,4,0],[3,1,4,1],[3,2,6,2],[3,4,4,4],[3,17,4,17],[5,0,6,0],[5,1,6,1],[5,4,6,4],[5,17,6,17],[6,5,7,5],[7,0,8,0],[7,1,8,1],[7,2,10,2],[7,4,8,4],[7,17,8,17]]}
[]
[]
["No","Gr","C #","Noms",null,"C #","\"B\"",null,"C #","\"C\"",null,"C #","\"D\"",null,null,null,null,"Classement"]
[1,{"$f":"LOOKUP(A4,#REF!,#REF!)","v":{"$error":"#REF!"}},1,{"$f":"CONCATENATE((LOOKUP(A4,#REF!,#REF!)),\" \",(LOOKUP(A4,#REF!,#REF!)))","v":{"$error":"#REF!"}},null,null,null,null,null,null,null,null,null,null,null,null,null,"Or",{"$f":"IF(N19>0,M19,IF(N20>0,M20,))","v":{"$error":"#REF!"}}]
[null,null,null,{"$f":"LOOKUP(D4,#REF!)","v":{"$error":"#REF!"}},null,null,null,null,null,null,null,null,null,null,null,null,null,null,{"$f":"LOOKUP(S4,#REF!)","v":{"$error":"#REF!"}}]
[9,{"$f":"LOOKUP(A6,#REF!,#REF!)","v":{"$error":"#REF!"}},null,{"$f":"CONCATENATE((LOOKUP(A6,#REF!,#REF!)),\" \",(LOOKUP(A6,#REF!,#REF!)))","v":{"$error":"#REF!"}},5,null,null,null,null,null,null,null,null,null,null,null,null,"Argent",{"$f":"IF(N19>0,M20,IF(N20>0,M19,0))","v":{"$error":"#REF!"}}]
[null,null,null,{"$f":"LOOKUP(D6,#REF!)","v":{"$error":"#REF!"}},null,9,{"$f":"IF($E$4>0,$D$4,IF($E$6>0,$D$6,IF($D$6=\" \",$D$4,\" \")))","v":{"$error":"#REF!"}},5,null,null,null,null,null,null,null,null,null,null,{"$f":"LOOKUP(S6,#REF!)","v":{"$error":"#REF!"}}]
[5,{"$f":"LOOKUP(A8,#REF!,#REF!)","v":{"$error":"#REF!"}},2,{"$f":"CONCATENATE((LOOKUP(A8,#REF!,#REF!)),\" \",(LOOKUP(A8,#REF!,#REF!)))","v":{"$error":"#REF!"}},10,null,{"$f":"IF($E$8>0,$D$8,IF($E$10>0,$D$10,IF($D$10=\" \",$D$8,\"\")))","v":{"$error":"#REF!"}},null,null,null,null,null,null,null,null,null,null,"Bronze",{"$f":"P45","v":{"$error":"#REF!"}}]
[null,null,null,{"$f":"LOOKUP(D8,#REF!)","v":{"$error":"#REF!"}},null,null,null,null,null,null,null,null,null,null,null,null,null,null,{"$f":"LOOKUP(S8,#REF!)","v":{"$error":"#REF!"}}]
[13,{"$f":"LOOKUP(A10,#REF!,#REF!)","v":{"$error":"#REF!"}},null,{"$f":"CONCATENATE((LOOKUP(A10,#REF!,#REF!)),\" \",(LOOKUP(A10,#REF!,#REF!)))","v":{"$error":"#REF!"}},null,null,null,null,null,null,null,null,null,null,null,null,null,"Bronze",{"$f":"P46","v":{"$error":"#REF!"}}]
[null,null,null,{"$f":"LOOKUP(D10,#REF!)","v":{"$error":"#REF!"}},null,null,null,null,17,{"$f":"IF(H7>0,G7,IF(H8>0,G8,))","v":{"$error":"#REF!"}},7,null,null,null,null,null,null,null,{"$f":"LOOKUP(S10,#REF!)","v":{"$error":"#REF!"}}]
[3,{"$f":"LOOKUP(A12,#REF!,#REF!)","v":{"$error":"#REF!"}},3,{"$f":"CONCATENATE((LOOKUP(A12,#REF!,#REF!)),\" \",(LOOKUP(A12,#REF!,#REF!)))","v":{"$error":"#REF!"}},null,null,null,null,null,{"$f":"IF(H15>0,G15,IF(H16>0,G16,))","v":{"$error":"#REF!"}}]
[null,null,null,{"$f":"LOOKUP(D12,#REF!)","v":{"$error":"#REF!"}}]
[11,{"$f":"LOOKUP(A14,#REF!,#REF!)","v":{"$error":"#REF!"}},null,{"$f":"CONCATENATE((LOOKUP(A14,#REF!,#REF!)),\" \",(LOOKUP(A14,#REF!,#REF!)))","v":{"$error":"#REF!"}},7]
[null,null,null,{"$f":"LOOKUP(D14,#REF!)","v":{"$error":"#REF!"}},null,10,{"$f":"IF($E$12>0,$D$12,IF($E$14>0,$D$14,IF($D$14=\" \",$D$12,\" \")))","v":{"$error":"#REF!"}},7]
[7,{"$f":"LOOKUP(A16,#REF!,#REF!)","v":{"$error":"#REF!"}},4,{"$f":"CONCATENATE((LOOKUP(A16,#REF!,#REF!)),\" \",(LOOKUP(A16,#REF!,#REF!)))","v":{"$error":"#REF!"}},7,null,{"$f":"IF($E$16>0,$D$16,IF($E$18>0,$D$18,IF($D$18=\" \",$D$16,\" \")))","v":{"$error":"#REF!"}}]
[null,null,null,{"$f":"LOOKUP(D16,#REF!)","v":{"$error":"#REF!"}}]
[15,{"$f":"LOOKUP(A18,#REF!,#REF!)","v":{"$error":"#REF!"}},null,{"$f":"CONCATENATE((LOOKUP(A18,#REF!,#REF!)),\" \",(LOOKUP(A18,#REF!,#REF!)))","v":{"$error":"#REF!"}}]
[null,null,null,{"$f":"LOOKUP(D18,#REF!)","v":{"$error":"#REF!"}},null,null,null,null,null,null,null,28,{"$f":"IF(K11>0,J11,IF(K12>0,J12,))","v":{"$error":"#REF!"}}]
[2,{"$f":"LOOKUP(A20,#REF!,#REF!)","v":{"$error":"#REF!"}},5,{"$f":"CONCATENATE((LOOKUP(A20,#REF!,#REF!)),\" \",(LOOKUP(A20,#REF!,#REF!)))","v":{"$error":"#REF!"}},10,null,null,null,null,null,null,null,{"$f":"IF(K27>0,J27,IF(K28>0,J28,))","v":{"$error":"#REF!"}},10]
[null,null,null,{"$f":"LOOKUP(D20,#REF!)","v":{"$error":"#REF!"}}]
[10,{"$f":"LOOKUP(A22,#REF!,#REF!)","v":{"$error":"#REF!"}},null,{"$f":"CONCATENATE((LOOKUP(A22,#REF!,#REF!)),\" \",(LOOKUP(A22,#REF!,#REF!)))","v":{"$error":"#REF!"}}]
[null,null,null,{"$f":"LOOKUP(D22,#REF!)","v":{"$error":"#REF!"}},null,11,{"$f":"IF($E$20>0,$D$20,IF($E$22>0,$D$22,IF($D$22=\" \",$D$20,\" \")))","v":{"$error":"#REF!"}}]
[6,{"$f":"LOOKUP(A24,#REF!,#REF!)","v":{"$error":"#REF!"}},6,{"$f":"CONCATENATE((LOOKUP(A24,#REF!,#REF!)),\" \",(LOOKUP(A24,#REF!,#REF!)))","v":{"$error":"#REF!"}},10,null,{"$f":"IF($E$24>0,$D$24,IF($E$26>0,$D$26,IF($D$26=\" \",$D$24,\" \")))","v":{"$error":"#REF!"}},10]
[null,null,null,{"$f":"LOOKUP(D24,#REF!)","v":{"$error":"#REF!"}}]
[14,{"$f":"LOOKUP(A26,#REF!,#REF!)","v":{"$error":"#REF!"}},null,{"$f":"CONCATENATE((LOOKUP(A26,#REF!,#REF!)),\" \",(LOOKUP(A26,#REF!,#REF!)))","v":{"$error":"#REF!"}}]
[null,null,null,{"$f":"LOOKUP(D26,#REF!)","v":{"$error":"#REF!"}},null,null,null,null,18,{"$f":"IF(H23>0,G23,IF(H24>0,G24,))","v":{"$error":"#REF!"}},10]
[4,{"$f":"LOOKUP(A28,#REF!,#REF!)","v":{"$error":"#REF!"}},7,{"$f":"CONCATENATE((LOOKUP(A28,#REF!,#REF!)),\" \",(LOOKUP(A28,#REF!,#REF!)))","v":{"$error":"#REF!"}},null,null,null,null,null,{"$f":"IF(H31>0,G31,IF(H32>0,G32,))","v":{"$error":"#REF!"}}]
[null,null,null,{"$f":"LOOKUP(D28,#REF!)","v":{"$error":"#REF!"}}]
[12,{"$f":"LOOKUP(A30,#REF!,#REF!)","v":{"$error":"#REF!"}},null,{"$f":"CONCATENATE((LOOKUP(A30,#REF!,#REF!)),\" \",(LOOKUP(A30,#REF!,#REF!)))","v":{"$error":"#REF!"}},10]
[null,null,null,{"$f":"LOOKUP(D30,#REF!)","v":{"$error":"#REF!"}},null,12,{"$f":"IF($E$28>0,$D$28,IF($E$30>0,$D$30,IF($D$30=\" \",$D$28,\" \")))","v":{"$error":"#REF!"}},7]
[8,{"$f":"LOOKUP(A32,#REF!,#REF!)","v":{"$error":"#REF!"}},8,{"$f":"CONCATENATE((LOOKUP(A32,#REF!,#REF!)),\" \",(LOOKUP(A32,#REF!,#REF!)))","v":{"$error":"#REF!"}},5,null,{"$f":"IF($E$32>0,$D$32,IF($E$34>0,$D$34,IF($D$34=\" \",$D$32,\" \")))","v":{"$error":"#REF!"}}]
[null,null,null,{"$f":"LOOKUP(D32,#REF!)","v":{"$error":"#REF!"}}]
[16,{"$f":"LOOKUP(A34,#REF!,#REF!)","v":{"$error":"#REF!"}},null,{"$f":"CONCATENATE((LOOKUP(A34,#REF!,#REF!)),\" \",(LOOKUP(A34,#REF!,#REF!)))","v":{"$error":"#REF!"}}]
[null,null,null,{"$f":"LOOKUP(D34,#REF!)","v":{"$error":"#REF!"}}]
[]
[null,null,"C #","Repêchage \"A\"",null,"C #","Repêchage \"B\"",null,"C #",null,null,"C #","Finalistes",null,null,"3e"]
["REPÊCHAGE"]
[null,null,13,{"$f":"IF($E4>0,$D6,IF(E6>0,$D4,))","v":{"$error":"#REF!"}},5,19,{"$f":"IF($E$39>0,$D$39,IF($E$40>0,$D$40,IF($D$40=\" \",$D$39,\" \")))","v":{"$error":"#REF!"}}]
[null,null,null,{"$f":"IF($E8>0,$D10,IF($E10>0,$D8,))","v":{"$error":"#REF!"}},null,null,{"$f":"IF(H15>0,G16,IF(H16>0,G15,))","v":{"$error":"#REF!"}},10]
[null,null,null,null,null,null,null,null,23,{"$f":"IF(H39>0,G39,IF(H40>0,G40,))","v":{"$error":"#REF!"}},null,25,{"$f":"IF(K41>0,J41,IF(K42>0,J42,))","v":{"$error":"#REF!"}},10]
[null,null,null,null,null,null,null,null,null,{"$f":"IF(H43>0,G43,IF(H44>0,G44,))","v":{"$error":"#REF!"}},7,null,{"$f":"IF(K28>0,J27,IF(K27>0,J28,))","v":{"$error":"#REF!"}}]
[null,null,14,{"$f":"IF($E12>0,$D14,IF(E14>0,$D12,))","v":{"$error":"#REF!"}},null,20,{"$f":"IF($E$43>0,$D$43,IF($E$44>0,$D$44,IF($D$44=\" \",$D$43,\" \")))","v":{"$error":"#REF!"}}]
[null,null,null,{"$f":"IF($E16>0,$D18,IF($E18>0,$D16,))","v":{"$error":"#REF!"}},7,null,{"$f":"IF(H7>0,G8,IF(H8>0,G7,))","v":{"$error":"#REF!"}},10]
[null,null,null,null,null,null,null,null,null,null,null,null,null,null,27,{"$f":"IF(N41>0,M41,IF(N42>0,M42,))","v":{"$error":"#REF!"}}]
[null,null,null,null,null,null,null,null,null,null,null,null,null,null,null,{"$f":"IF(N49>0,M49,IF(N50>0,M50,))","v":{"$error":"#REF!"}}]
[null,null,15,{"$f":"IF($E20>0,$D22,IF(E22>0,$D20,))","v":{"$error":"#REF!"}},10,21,{"$f":"IF($E$47>0,$D$47,IF($E$48>0,$D$48,IF($D$48=\" \",$D$47,\" \")))","v":{"$error":"#REF!"}},7]
[null,null,null,{"$f":"IF($E24>0,$D26,IF($E26>0,$D24,))","v":{"$error":"#REF!"}},null,null,{"$f":"IF(H31>0,G32,IF(H32>0,G31,))","v":{"$error":"#REF!"}}]
[null,null,null,null,null,null,null,null,24,{"$f":"IF(H47>0,G47,IF(H48>0,G48,))","v":{"$error":"#REF!"}},7,26,{"$f":"IF(K49>0,J49,IF(K50>0,J50,))","v":{"$error":"#REF!"}},10]
[null,null,null,null,null,null,null,null,null,{"$f":"IF(H51>0,G51,IF(H52>0,G52,))","v":{"$error":"#REF!"}},null,null,{"$f":"IF(K12>0,J11,IF(K11>0,J12,))","v":{"$error":"#REF!"}}]
[null,null,16,{"$f":"IF($E28>0,$D30,IF(E30>0,$D28,))","v":{"$error":"#REF!"}},null,22,{"$f":"IF($E$51>0,$D$51,IF($E$52>0,$D$52,IF($D$52=\" \",$D$51,\" \")))","v":{"$error":"#REF!"}},10]
[null,null,null,{"$f":"IF($E32>0,$D34,IF($E34>0,$D32,))","v":{"$error":"#REF!"}},10,null,{"$f":"IF(H23>0,G24,IF(H24>0,G23,))","v":{"$error":"#REF!"}}]

{"sheet":"Tournois 32","index":13,"n_rows":102,"n_cols":19,"rows_kept":102,"cut":false,"hidden":true,"merged":[[78,18,79,18],[80,2,81,2],[80,5,81,5],[82,8,83,8],[82,11,83,11],[84,2,85,2],[84,5,85,5],[87,17,88,17],[88,2,89,2],[88,5,89,5],[71,0,102,1],[72,2,73,2],[72,5,73,5],[74,8,75,8],[74,11,75,11],[76,2,77,2],[76,5,77,5],[78,11,79,11],[78,14,79,14],[90,8,91,8],[90,11,91,11],[92,2,93,2],[92,5,93,5],[94,11,95,11],[94,14,95,14],[96,2,97,2],[96,5,97,5],[98,8,99,8],[98,11,99,11],[100,2,101,2],[100,5,101,5],[61,5,64,5],[63,0,64,0],[63,1,64,1],[63,2,66,2],[63,4,64,4],[65,0,66,0],[65,1,66,1],[65,4,66,4],[70,0,70,1],[50,11,51,11],[51,0,52,0],[51,1,52,1],[51,2,54,2],[51,4,52,4],[53,0,54,0],[53,1,54,1],[53,4,54,4],[53,5,56,5],[55,0,56,0],[55,1,56,1],[55,2,58,2],[55,4,56,4],[57,0,58,0],[57,1,58,1],[57,4,58,4],[58,8,59,8],[59,0,60,0],[59,1,60,1],[59,2,62,2],[59,4,60,4],[61,0,62,0],[61,1,62,1],[61,4,62,4],[42,8,43,8],[43,0,44,0],[43,1,44,1],[43,2,46,2],[43,4,44,4],[45,0,46,0],[45,1,46,1],[45,4,46,4],[45,5,48,5],[47,0,48,0],[47,1,48,1],[47,2,50,2],[47,4,48,4],[49,0,50,0],[49,1,50,1],[49,4,50,4],[35,0,36,0],[35,1,36,1],[35,2,38,2],[35,4,36,4],[37,0,38,0],[37,1,38,1],[37,4,38,4],[37,5,40,5],[39,0,40,0],[39,1,40,1],[39,2,42,2],[39,4,40,4],[41,0,42,0],[41,1,42,1],[41,4,42,4],[29,5,32,5],[31,0,32,0],[31,1,32,1],[31,2,34,2],[31,4,32,4],[33,0,34,0],[33,1,34,1],[33,4,34,4],[33,14,34,14],[18,11,19,11],[19,0,20,0],[19,1,20,1],[19,2,22,2],[19,4,20,4],[21,0,22,0],[21,1,22,1],[21,4,22,4],[21,5,24,5],[23,0,24,0],[23,1,24,1],[23,2,26,2],[23,4,24,4],[25,0,26,0],[25,1,26,1],[25,4,26,4],[26,8,27,8],[27,0,28,0],[27,1,28,1],[27,2,30,2],[27,4,28,4],[29,0,30,0],[29,1,30,1],[29,4,30,4],[11,4,12,4],[13,0,14,0],[13,1,14,1],[13,4,14,4],[13,5,16,5],[15,0,16,0],[15,1,16,1],[15,2,18,2],[15,4,16,4],[17,0,18,0],[17,1,18,1],[17,4,18,4],[2,17,2,18],[3,0,4,0],[3,1,4,1],[3,2,6,2],[3,4,4,4],[3,17,4,17],[5,0,6,0],[5,1,6,1],[5,4,6,4],[5,5,8,5],[5,17,6,17],[7,0,8,0],[7,1,8,1],[7,2,10,2],[7,4,8,4],[7,17,8,17],[9,0,10,0],[9,1,10,1],[9,4,10,4],[9,17,10,17],[10,8,11,8],[11,0,12,0],[11,1,12,1],[11,2,14,2]]}
[]
[]
["No","Gr","C #","Noms",null,"C #","\"B\"",null,"C #","\"C\"",null,"C #","\"D\"",null,null,"1er",null,"Classement"]
[1,{"$f":"LOOKUP(A4,#REF!,#REF!)","v":{"$error":"#REF!"}},1,{"$f":"CONCATENATE((LOOKUP(A4,#REF!,#REF!)),\" \",(LOOKUP(A4,#REF!,#REF!)))","v":{"$error":"#REF!"}},7,null,null,null,null,null,null,null,null,null,null,null,null,"Or",{"$f":"IF(Q34>0,P34,IF(Q35>0,P35,))","v":{"$error":"#REF!"}}]
[null,null,null,{"$f":"LOOKUP(D4,#REF!)","v":{"$error":"#REF!"}},null,null,null,null,null,null,null,null,null,null,null,null,null,null,{"$f":"LOOKUP(S4,#REF!)","v":{"$error":"#REF!"}}]
[17,{"$f":"LOOKUP(A6,#REF!,#REF!)","v":{"$error":"#REF!"}},null,{"$f":"CONCATENATE((LOOKUP(A6,#REF!,#REF!)),\" \",(LOOKUP(A6,#REF!,#REF!)))","v":{"$error":"#REF!"}},null,9,null,null,null,null,null,null,null,null,null,null,null,"Argent",{"$f":"IF(Q34>0,P35,IF(Q35>0,P34,0))","v":{"$error":"#REF!"}}]
[null,null,null,{"$f":"LOOKUP(D6,#REF!)","v":{"$error":"#REF!"}},null,null,{"$f":"IF($E$4>0,$D$4,IF($E$6>0,$D$6,IF($D$6=\" \",$D$4,\" \")))","v":{"$error":"#REF!"}},10,null,null,null,null,null,null,null,null,null,null,{"$f":"LOOKUP(S6,#REF!)","v":{"$error":"#REF!"}}]
[9,{"$f":"LOOKUP(A8,#REF!,#REF!)","v":{"$error":"#REF!"}},2,{"$f":"CONCATENATE((LOOKUP(A8,#REF!,#REF!)),\" \",(LOOKUP(A8,#REF!,#REF!)))","v":{"$error":"#REF!"}},null,null,{"$f":"IF($E$8>0,$D$8,IF($E$10>0,$D$10,IF($D$10=\" \",$D$8,\"\")))","v":{"$error":"#REF!"}},null,null,null,null,null,null,null,null,null,null,"Bronze",{"$f":"S51","v":0}]
[null,null,null,{"$f":"LOOKUP(D8,#REF!)","v":{"$error":"#REF!"}},null,null,null,null,null,null,null,null,null,null,null,null,null,null,{"$f":"LOOKUP(S8,#REF!)","v":{"$error":"#REF!"}}]
[25,{"$f":"LOOKUP(A10,#REF!,#REF!)","v":{"$error":"#REF!"}},null,{"$f":"CONCATENATE((LOOKUP(A10,#REF!,#REF!)),\" \",(LOOKUP(A10,#REF!,#REF!)))","v":{"$error":"#REF!"}},5,null,null,null,null,null,null,null,null,null,null,null,null,"Bronze",{"$f":"S52","v":0}]
[null,null,null,{"$f":"LOOKUP(D10,#REF!)","v":{"$error":"#REF!"}},null,null,null,null,17,{"$f":"IF(H7>0,G7,IF(H8>0,G8,))","v":{"$error":"#REF!"}},null,null,null,null,null,null,null,null,{"$f":"LOOKUP(S10,#REF!)","v":{"$error":"#REF!"}}]
[5,{"$f":"LOOKUP(A12,#REF!,#REF!)","v":{"$error":"#REF!"}},3,{"$f":"CONCATENATE((LOOKUP(A12,#REF!,#REF!)),\" \",(LOOKUP(A12,#REF!,#REF!)))","v":{"$error":"#REF!"}},null,null,null,null,null,{"$f":"IF(H15>0,G15,IF(H16>0,G16,))","v":{"$error":"#REF!"}},10]
[null,null,null,{"$f":"LOOKUP(D12,#REF!)","v":{"$error":"#REF!"}}]
[21,{"$f":"LOOKUP(A14,#REF!,#REF!)","v":{"$error":"#REF!"}},null,{"$f":"CONCATENATE((LOOKUP(A14,#REF!,#REF!)),\" \",(LOOKUP(A14,#REF!,#REF!)))","v":{"$error":"#REF!"}},10,10]
[null,null,null,{"$f":"LOOKUP(D14,#REF!)","v":{"$error":"#REF!"}},null,null,{"$f":"IF($E$12>0,$D$12,IF($E$14>0,$D$14,IF($D$14=\" \",$D$12,\" \")))","v":{"$error":"#REF!"}},10]
[13,{"$f":"LOOKUP(A16,#REF!,#REF!)","v":{"$error":"#REF!"}},4,{"$f":"CONCATENATE((LOOKUP(A16,#REF!,#REF!)),\" \",(LOOKUP(A16,#REF!,#REF!)))","v":{"$error":"#REF!"}},null,null,{"$f":"IF($E$16>0,$D$16,IF($E$18>0,$D$18,IF($D$18=\" \",$D$16,\" \")))","v":{"$error":"#REF!"}}]
[null,null,null,{"$f":"LOOKUP(D16,#REF!)","v":{"$error":"#REF!"}}]
[29,{"$f":"LOOKUP(A18,#REF!,#REF!)","v":{"$error":"#REF!"}},null,{"$f":"CONCATENATE((LOOKUP(A18,#REF!,#REF!)),\" \",(LOOKUP(A18,#REF!,#REF!)))","v":{"$error":"#REF!"}},10]
[null,null,null,{"$f":"LOOKUP(D18,#REF!)","v":{"$error":"#REF!"}},null,null,null,null,null,null,null,28,{"$f":"IF(K10>0,J10,IF(K12>0,J12,))","v":{"$error":"#REF!"}}]
[3,{"$f":"LOOKUP(A20,#REF!,#REF!)","v":{"$error":"#REF!"}},5,{"$f":"CONCATENATE((LOOKUP(A20,#REF!,#REF!)),\" \",(LOOKUP(A20,#REF!,#REF!)))","v":{"$error":"#REF!"}},null,null,null,null,null,null,null,null,{"$f":"IF(K26>0,J26,IF(K28>0,J28,))","v":{"$error":"#REF!"}},10]
[null,null,null,{"$f":"LOOKUP(D20,#REF!)","v":{"$error":"#REF!"}}]
[19,{"$f":"LOOKUP(A22,#REF!,#REF!)","v":{"$error":"#REF!"}},null,{"$f":"CONCATENATE((LOOKUP(A22,#REF!,#REF!)),\" \",(LOOKUP(A22,#REF!,#REF!)))","v":{"$error":"#REF!"}},5,11]
[null,null,null,{"$f":"LOOKUP(D22,#REF!)","v":{"$error":"#REF!"}},null,null,{"$f":"IF($E$20>0,$D$20,IF($E$22>0,$D$22,IF($D$22=\" \",$D$20,\" \")))","v":{"$error":"#REF!"}}]
[11,{"$f":"LOOKUP(A24,#REF!,#REF!)","v":{"$error":"#REF!"}},6,{"$f":"CONCATENATE((LOOKUP(A24,#REF!,#REF!)),\" \",(LOOKUP(A24,#REF!,#REF!)))","v":{"$error":"#REF!"}},null,null,{"$f":"IF($E$24>0,$D$24,IF($E$26>0,$D$26,IF($D$26=\" \",$D$24,\" \")))","v":{"$error":"#REF!"}},10]
[null,null,null,{"$f":"LOOKUP(D24,#REF!)","v":{"$error":"#REF!"}}]
[27,{"$f":"LOOKUP(A26,#REF!,#REF!)","v":{"$error":"#REF!"}},null,{"$f":"CONCATENATE((LOOKUP(A26,#REF!,#REF!)),\" \",(LOOKUP(A26,#REF!,#REF!)))","v":{"$error":"#REF!"}},7]
[null,null,null,{"$f":"LOOKUP(D26,#REF!)","v":{"$error":"#REF!"}},null,null,null,null,18,{"$f":"IF(H23>0,G23,IF(H24>0,G24,))","v":{"$error":"#REF!"}}]
[7,{"$f":"LOOKUP(A28,#REF!,#REF!)","v":{"$error":"#REF!"}},7,{"$f":"CONCATENATE((LOOKUP(A28,#REF!,#REF!)),\" \",(LOOKUP(A28,#REF!,#REF!)))","v":{"$error":"#REF!"}},null,null,null,null,null,{"$f":"IF(H31>0,G31,IF(H32>0,G32,))","v":{"$error":"#REF!"}},10]
[null,null,null,{"$f":"LOOKUP(D28,#REF!)","v":{"$error":"#REF!"}}]
[23,{"$f":"LOOKUP(A30,#REF!,#REF!)","v":{"$error":"#REF!"}},null,{"$f":"CONCATENATE((LOOKUP(A30,#REF!,#REF!)),\" \",(LOOKUP(A30,#REF!,#REF!)))","v":{"$error":"#REF!"}},10,12]
[null,null,null,{"$f":"LOOKUP(D30,#REF!)","v":{"$error":"#REF!"}},null,null,{"$f":"IF($E$28>0,$D$28,IF($E$30>0,$D$30,IF($D$30=\" \",$D$28,\" \")))","v":{"$error":"#REF!"}},10]
[15,{"$f":"LOOKUP(A32,#REF!,#REF!)","v":{"$error":"#REF!"}},8,{"$f":"CONCATENATE((LOOKUP(A32,#REF!,#REF!)),\" \",(LOOKUP(A32,#REF!,#REF!)))","v":{"$error":"#REF!"}},10,null,{"$f":"IF($E$32>0,$D$32,IF($E$34>0,$D$34,IF($D$34=\" \",$D$32,\" \")))","v":{"$error":"#REF!"}}]
[null,null,null,{"$f":"LOOKUP(D32,#REF!)","v":{"$error":"#REF!"}}]
[31,{"$f":"LOOKUP(A34,#REF!,#REF!)","v":{"$error":"#REF!"}},null,{"$f":"CONCATENATE((LOOKUP(A34,#REF!,#REF!)),\" \",(LOOKUP(A34,#REF!,#REF!)))","v":{"$error":"#REF!"}},null,null,null,null,null,null,null,null,null,null,null,{"$f":"IF(N19>0,M19,IF(N20>0,M20,))","v":{"$error":"#REF!"}}]
[null,null,null,{"$f":"LOOKUP(D34,#REF!)","v":{"$error":"#REF!"}},null,null,null,null,null,null,null,null,null,null,null,{"$f":"IF(N51>0,M51,IF(N52>0,M52,))","v":{"$error":"#REF!"}},10]
[2,{"$f":"LOOKUP(A36,#REF!,#REF!)","v":{"$error":"#REF!"}},1,{"$f":"CONCATENATE((LOOKUP(A36,#REF!,#REF!)),\" \",(LOOKUP(A36,#REF!,#REF!)))","v":{"$error":"#REF!"}},7]
[null,null,null,{"$f":"LOOKUP(D36,#REF!)","v":{"$error":"#REF!"}}]
[18,{"$f":"LOOKUP(A38,#REF!,#REF!)","v":{"$error":"#REF!"}},null,{"$f":"CONCATENATE((LOOKUP(A38,#REF!,#REF!)),\" \",(LOOKUP(A38,#REF!,#REF!)))","v":{"$error":"#REF!"}}]
[null,null,null,{"$f":"LOOKUP(D38,#REF!)","v":{"$error":"#REF!"}},null,null,{"$f":"IF($E$4>0,$D$4,IF($E$6>0,$D$6,IF($D$6=\" \",$D$4,\" \")))","v":{"$error":"#REF!"}},7]
[10,{"$f":"LOOKUP(A40,#REF!,#REF!)","v":{"$error":"#REF!"}},2,{"$f":"CONCATENATE((LOOKUP(A40,#REF!,#REF!)),\" \",(LOOKUP(A40,#REF!,#REF!)))","v":{"$error":"#REF!"}},7,null,{"$f":"IF($E$8>0,$D$8,IF($E$10>0,$D$10,IF($D$10=\" \",$D$8,\"\")))","v":{"$error":"#REF!"}}]
[null,null,null,{"$f":"LOOKUP(D40,#REF!)","v":{"$error":"#REF!"}}]
[26,{"$f":"LOOKUP(A42,#REF!,#REF!)","v":{"$error":"#REF!"}},null,{"$f":"CONCATENATE((LOOKUP(A42,#REF!,#REF!)),\" \",(LOOKUP(A42,#REF!,#REF!)))","v":{"$error":"#REF!"}}]
[null,null,null,{"$f":"LOOKUP(D42,#REF!)","v":{"$error":"#REF!"}},null,null,null,null,null,{"$f":"IF(H39>0,G39,IF(H40>0,G40,))","v":{"$error":"#REF!"}},10]
[6,{"$f":"LOOKUP(A44,#REF!,#REF!)","v":{"$error":"#REF!"}},3,{"$f":"CONCATENATE((LOOKUP(A44,#REF!,#REF!)),\" \",(LOOKUP(A44,#REF!,#REF!)))","v":{"$error":"#REF!"}},10,null,null,null,null,{"$f":"IF(H47>0,G47,IF(H48>0,G48,))","v":{"$error":"#REF!"}}]
[null,null,null,{"$f":"LOOKUP(D44,#REF!)","v":{"$error":"#REF!"}}]
[22,{"$f":"LOOKUP(A46,#REF!,#REF!)","v":{"$error":"#REF!"}},null,{"$f":"CONCATENATE((LOOKUP(A46,#REF!,#REF!)),\" \",(LOOKUP(A46,#REF!,#REF!)))","v":{"$error":"#REF!"}},null,10]
[null,null,null,{"$f":"LOOKUP(D46,#REF!)","v":{"$error":"#REF!"}},null,null,{"$f":"IF($E$12>0,$D$12,IF($E$14>0,$D$14,IF($D$14=\" \",$D$12,\" \")))","v":{"$error":"#REF!"}}]
[14,{"$f":"LOOKUP(A48,#REF!,#REF!)","v":{"$error":"#REF!"}},4,{"$f":"CONCATENATE((LOOKUP(A48,#REF!,#REF!)),\" \",(LOOKUP(A48,#REF!,#REF!)))","v":{"$error":"#REF!"}},null,null,{"$f":"IF($E$16>0,$D$16,IF($E$18>0,$D$18,IF($D$18=\" \",$D$16,\" \")))","v":{"$error":"#REF!"}},10]
[null,null,null,{"$f":"LOOKUP(D48,#REF!)","v":{"$error":"#REF!"}}]
[30,{"$f":"LOOKUP(A50,#REF!,#REF!)","v":{"$error":"#REF!"}},null,{"$f":"CONCATENATE((LOOKUP(A50,#REF!,#REF!)),\" \",(LOOKUP(A50,#REF!,#REF!)))","v":{"$error":"#REF!"}},10]
[null,null,null,{"$f":"LOOKUP(D50,#REF!)","v":{"$error":"#REF!"}},null,null,null,null,null,null,null,null,{"$f":"IF(K43>0,J43,IF(K44>0,J44,))","v":{"$error":"#REF!"}}]
[4,{"$f":"LOOKUP(A52,#REF!,#REF!)","v":{"$error":"#REF!"}},5,{"$f":"CONCATENATE((LOOKUP(A52,#REF!,#REF!)),\" \",(LOOKUP(A52,#REF!,#REF!)))","v":{"$error":"#REF!"}},null,null,null,null,null,null,null,null,{"$f":"IF(K59>0,J59,IF(K60>0,J60,))","v":{"$error":"#REF!"}},10]
[null,null,null,{"$f":"LOOKUP(D52,#REF!)","v":{"$error":"#REF!"}}]
[20,{"$f":"LOOKUP(A54,#REF!,#REF!)","v":{"$error":"#REF!"}},null,{"$f":"CONCATENATE((LOOKUP(A54,#REF!,#REF!)),\" \",(LOOKUP(A54,#REF!,#REF!)))","v":{"$error":"#REF!"}},10,11]
[null,null,null,{"$f":"LOOKUP(D54,#REF!)","v":{"$error":"#REF!"}},null,null,{"$f":"IF($E$20>0,$D$20,IF($E$22>0,$D$22,IF($D$22=\" \",$D$20,\" \")))","v":{"$error":"#REF!"}}]
[12,{"$f":"LOOKUP(A56,#REF!,#REF!)","v":{"$error":"#REF!"}},6,{"$f":"CONCATENATE((LOOKUP(A56,#REF!,#REF!)),\" \",(LOOKUP(A56,#REF!,#REF!)))","v":{"$error":"#REF!"}},7,null,{"$f":"IF($E$24>0,$D$24,IF($E$26>0,$D$26,IF($D$26=\" \",$D$24,\" \")))","v":{"$error":"#REF!"}},10]
[null,null,null,{"$f":"LOOKUP(D56,#REF!)","v":{"$error":"#REF!"}}]
[28,{"$f":"LOOKUP(A58,#REF!,#REF!)","v":{"$error":"#REF!"}},null,{"$f":"CONCATENATE((LOOKUP(A58,#REF!,#REF!)),\" \",(LOOKUP(A58,#REF!,#REF!)))","v":{"$error":"#REF!"}},null,null,null,null,18]
[null,null,null,{"$f":"LOOKUP(D58,#REF!)","v":{"$error":"#REF!"}},null,null,null,null,null,{"$f":"IF(H55>0,G55,IF(H56>0,G56,))","v":{"$error":"#REF!"}}]
[8,{"$f":"LOOKUP(A60,#REF!,#REF!)","v":{"$error":"#REF!"}},7,{"$f":"CONCATENATE((LOOKUP(A60,#REF!,#REF!)),\" \",(LOOKUP(A60,#REF!,#REF!)))","v":{"$error":"#REF!"}},7,null,null,null,null,{"$f":"IF(H63>0,G63,IF(H64>0,G64,))","v":{"$error":"#REF!"}},7]
[null,null,null,{"$f":"LOOKUP(D60,#REF!)","v":{"$error":"#REF!"}}]
[24,{"$f":"LOOKUP(A62,#REF!,#REF!)","v":{"$error":"#REF!"}},null,{"$f":"CONCATENATE((LOOKUP(A62,#REF!,#REF!)),\" \",(LOOKUP(A62,#REF!,#REF!)))","v":{"$error":"#REF!"}},null,12]
[null,null,null,{"$f":"LOOKUP(D62,#REF!)","v":{"$error":"#REF!"}},null,null,{"$f":"IF($E$28>0,$D$28,IF($E$30>0,$D$30,IF($D$30=\" \",$D$28,\" \")))","v":{"$error":"#REF!"}}]
[16,{"$f":"LOOKUP(A64,#REF!,#REF!)","v":{"$error":"#REF!"}},8,{"$f":"CONCATENATE((LOOKUP(A64,#REF!,#REF!)),\" \",(LOOKUP(A64,#REF!,#REF!)))","v":{"$error":"#REF!"}},10,null,{"$f":"IF($E$32>0,$D$32,IF($E$34>0,$D$34,IF($D$34=\" \",$D$32,\" \")))","v":{"$error":"#REF!"}},10]
[null,null,null,{"$f":"LOOKUP(D64,#REF!)","v":{"$error":"#REF!"}}]
[32,{"$f":"LOOKUP(A66,#REF!,#REF!)","v":{"$error":"#REF!"}},null,{"$f":"CONCATENATE((LOOKUP(A66,#REF!,#REF!)),\" \",(LOOKUP(A66,#REF!,#REF!)))","v":{"$error":"#REF!"}}]
[null,null,null,{"$f":"LOOKUP(D66,#REF!)","v":{"$error":"#REF!"}}]
[]
[]
[]
[null,null,"C #","Repêchage \"A\"",null,"C #","Repêchage \"B\"",null,"C #","Repêchage \"C\"",null,"C #","Repêchage \"D\"",null,"C #","Finalistes",null,null,"3e"]
["REPÊCHAGE"]
[null,null,null,{"$f":"IF($E4>0,$D6,IF(E6>0,$D4,))","v":{"$error":"#REF!"}},null,null,{"$f":"IF($E$73>0,$D$73,IF($E$74>0,$D$74,IF($D$74=\" \",$D$73,\" \")))","v":{"$error":"#REF!"}}]
[null,null,null,{"$f":"IF($E8>0,$D10,IF($E10>0,$D8,))","v":{"$error":"#REF!"}},null,null,{"$f":"IF(H14>0,G16,IF(H16>0,G14,))","v":0}]
[null,null,null,null,null,null,null,null,null,{"$f":"IF(H73>0,G73,IF(H74>0,G74,))","v":0},null,null,{"$f":"IF(K75>0,J75,IF(K76>0,J76,))","v":0},10]
[null,null,null,null,null,null,null,null,null,{"$f":"IF(H77>0,G77,IF(H78>0,G78,))","v":0},7,null,{"$f":"IF(K28>0,J26,IF(K26>0,J28,))","v":0}]
[null,null,null,{"$f":"IF($E12>0,$D14,IF(E14>0,$D12,))","v":{"$error":"#REF!"}},null,null,{"$f":"IF($E$77>0,$D$77,IF($E$78>0,$D$78,IF($D$78=\" \",$D$77,\" \")))","v":{"$error":"#REF!"}}]
[null,null,null,{"$f":"IF($E16>0,$D18,IF($E18>0,$D16,))","v":{"$error":"#REF!"}},null,null,{"$f":"IF(H6>0,G8,IF(H8>0,G6,))","v":0}]
[null,null,null,null,null,null,null,null,null,null,null,null,null,null,null,{"$f":"IF(N75>0,M75,IF(N76>0,M76,))","v":0}]
[null,null,null,null,null,null,null,null,null,null,null,null,null,null,null,{"$f":"IF(N83>0,M83,IF(N84>0,M84,))","v":0}]
[null,null,null,{"$f":"IF($E20>0,$D22,IF(E22>0,$D20,))","v":{"$error":"#REF!"}},null,null,{"$f":"IF($E$81>0,$D$81,IF($E$82>0,$D$82,IF($D$82=\" \",$D$81,\" \")))","v":{"$error":"#REF!"}}]
[null,null,null,{"$f":"IF($E24>0,$D26,IF($E26>0,$D24,))","v":{"$error":"#REF!"}},null,null,{"$f":"IF(H30>0,G32,IF(H32>0,G30,))","v":0}]
[null,null,null,null,null,null,null,null,null,{"$f":"IF(H81>0,G81,IF(H82>0,G82,))","v":0},null,null,{"$f":"IF(K83>0,J83,IF(K84>0,J84,))","v":0}]
[null,null,null,null,null,null,null,null,null,{"$f":"IF(H85>0,G85,IF(H86>0,G86,))","v":0},"-",null,{"$f":"IF(K12>0,J10,IF(K10>0,J12,))","v":0},10]
[null,null,null,{"$f":"IF($E28>0,$D30,IF(E30>0,$D28,))","v":{"$error":"#REF!"}},null,null,{"$f":"IF($E$85>0,$D$85,IF($E$86>0,$D$86,IF($D$86=\" \",$D$85,\" \")))","v":{"$error":"#REF!"}}]
[null,null,null,{"$f":"IF($E32>0,$D34,IF($E34>0,$D32,))","v":{"$error":"#REF!"}},null,null,{"$f":"IF(H22>0,G24,IF(H24>0,G22,))","v":0}]
[]
[]
[null,null,null,{"$f":"IF($E20>0,$D22,IF(E22>0,$D20,))","v":{"$error":"#REF!"}},null,null,{"$f":"IF($E$73>0,$D$73,IF($E$74>0,$D$74,IF($D$74=\" \",$D$73,\" \")))","v":{"$error":"#REF!"}}]
[null,null,null,{"$f":"IF($E24>0,$D26,IF($E26>0,$D24,))","v":{"$error":"#REF!"}},null,null,{"$f":"IF(H30>0,G32,IF(H32>0,G30,))","v":0}]
[null,null,null,null,null,null,null,null,null,{"$f":"IF(H89>0,G89,IF(H90>0,G90,))","v":0},null,null,{"$f":"IF(K91>0,J91,IF(K92>0,J92,))","v":0},10]
[null,null,null,null,null,null,null,null,null,{"$f":"IF(H93>0,G93,IF(H94>0,G94,))","v":0},7,null,{"$f":"IF(K44>0,J42,IF(K42>0,J44,))","v":0}]
[null,null,null,{"$f":"IF($E28>0,$D30,IF(E30>0,$D28,))","v":{"$error":"#REF!"}},null,null,{"$f":"IF($E$77>0,$D$77,IF($E$78>0,$D$78,IF($D$78=\" \",$D$77,\" \")))","v":{"$error":"#REF!"}}]
[null,null,null,{"$f":"IF($E32>0,$D34,IF($E34>0,$D32,))","v":{"$error":"#REF!"}},null,null,{"$f":"IF(H22>0,G24,IF(H24>0,G22,))","v":0}]
[null,null,null,null,null,null,null,null,null,null,null,null,null,null,null,{"$f":"IF(N91>0,M91,IF(N92>0,M92,))","v":0}]
[null,null,null,null,null,null,null,null,null,null,null,null,null,null,null,{"$f":"IF(N99>0,M99,IF(N100>0,M100,))","v":0}]
[null,null,null,{"$f":"IF($E36>0,$D38,IF(E38>0,$D36,))","v":{"$error":"#REF!"}},null,null,{"$f":"IF($E$81>0,$D$81,IF($E$82>0,$D$82,IF($D$82=\" \",$D$81,\" \")))","v":{"$error":"#REF!"}}]
[null,null,null,{"$f":"IF($E40>0,$D42,IF($E42>0,$D40,))","v":{"$error":"#REF!"}},null,null,{"$f":"IF(H46>0,G48,IF(H48>0,G46,))","v":0}]
[null,null,null,null,null,null,null,null,null,{"$f":"IF(H97>0,G97,IF(H98>0,G98,))","v":0},null,null,{"$f":"IF(K99>0,J99,IF(K100>0,J100,))","v":0}]
[null,null,null,null,null,null,null,null,null,{"$f":"IF(H101>0,G101,IF(H102>0,G102,))","v":0},"-",null,{"$f":"IF(K28>0,J26,IF(K26>0,J28,))","v":0},10]
[null,null,null,{"$f":"IF($E44>0,$D46,IF(E46>0,$D44,))","v":{"$error":"#REF!"}},null,null,{"$f":"IF($E$85>0,$D$85,IF($E$86>0,$D$86,IF($D$86=\" \",$D$85,\" \")))","v":{"$error":"#REF!"}}]
[null,null,null,{"$f":"IF($E48>0,$D50,IF($E50>0,$D48,))","v":{"$error":"#REF!"}},null,null,{"$f":"IF(H38>0,G40,IF(H40>0,G38,))","v":0}]

{"sheet":"Arbitre","index":14,"n_rows":51,"n_cols":22,"rows_kept":51,"cut":false,"hidden":true,"merged":[]}
["Prénom","Nom","Dojo",null,null,null,null,null,null,null,null,null,null,null,null,null,null,null,null,null,null,{"$f":"#REF!","v":{"$error":"#REF!"}}]
["a","b","Hakudo Kan",null,null,null,null,null,null,null,null,null,null,null,null,null,null,null,null,null,null,{"$f":"#REF!","v":{"$error":"#REF!"}}]
["b",null,"Fujiyama",null,null,null,null,null,null,null,null,null,null,null,null,null,null,null,null,null,null,{"$f":"#REF!","v":{"$error":"#REF!"}}]
["c",null,"Hakudo Kan",null,null,null,null,null,null,null,null,null,null,null,null,null,null,null,null,null,null,{"$f":"#REF!","v":{"$error":"#REF!"}}]
["d",null,"Chateauguay",null,null,null,null,null,null,null,null,null,null,null,null,null,null,null,null,null,null,{"$f":"#REF!","v":{"$error":"#REF!"}}]
["d",null,"Fujiyama",null,null,null,null,null,null,null,null,null,null,null,null,null,null,null,null,null,null,{"$f":"#REF!","v":{"$error":"#REF!"}}]
["e",null,"Beloeil",null,null,null,null,null,null,null,null,null,null,null,null,null,null,null,null,null,null,{"$f":"#REF!","v":{"$error":"#REF!"}}]
["f",null,"Boucherville",null,null,null,null,null,null,null,null,null,null,null,null,null,null,null,null,null,null,{"$f":"#REF!","v":{"$error":"#REF!"}}]
["g",null,"CEMCUM",null,null,null,null,null,null,null,null,null,null,null,null,null,null,null,null,null,null,{"$f":"#REF!","v":{"$error":"#REF!"}}]
["h",null,"Boucherville",null,null,null,null,null,null,null,null,null,null,null,null,null,null,null,null,null,null,{"$f":"#REF!","v":{"$error":"#REF!"}}]
["i",null,"St-Hubert",null,null,null,null,null,null,null,null,null,null,null,null,null,null,null,null,null,null,{"$f":"#REF!","v":{"$error":"#REF!"}}]
["j",null,"Albatros",null,null,null,null,null,null,null,null,null,null,null,null,null,null,null,null,null,null,{"$f":"#REF!","v":{"$error":"#REF!"}}]
["k",null,"Zyx",null,null,null,null,null,null,null,null,null,null,null,null,null,null,null,null,null,null,{"$f":"#REF!","v":{"$error":"#REF!"}}]
[null,null," ",null,null,null,null,null,null,null,null,null,null,null,null,null,null,null,null,null,null,{"$f":"#REF!","v":{"$error":"#REF!"}}]
[null,null," ",null,null,null,null,null,null,null,null,null,null,null,null,null,null,null,null,null,null,{"$f":"#REF!","v":{"$error":"#REF!"}}]
[null,null," ",null,null,null,null,null,null,null,null,null,null,null,null,null,null,null,null,null,null,{"$f":"#REF!","v":{"$error":"#REF!"}}]
[null,null," ",null,null,null,null,null,null,null,null,null,null,null,null,null,null,null,null,null,null,{"$f":"#REF!","v":{"$error":"#REF!"}}]
[null,null," ",null,null,null,null,null,null,null,null,null,null,null,null,null,null,null,null,null,null,{"$f":"#REF!","v":{"$error":"#REF!"}}]
[null,null," ",null,null,null,null,null,null,null,null,null,null,null,null,null,null,null,null,null,null,{"$f":"#REF!","v":{"$error":"#REF!"}}]
[null,null," ",null,null,null,null,null,null,null,null,null,null,null,null,null,null,null,null,null,null,{"$f":"#REF!","v":{"$error":"#REF!"}}]
[null,null," ",null,null,null,null,null,null,null,null,null,null,null,null,null,null,null,null,null,null,{"$f":"#REF!","v":{"$error":"#REF!"}}]
[null,null,null,null,null,null,null,null,null,null,null,null,null,null,null,null,null,null,null,null,null,{"$f":"#REF!","v":{"$error":"#REF!"}}]
[null,null,null,null,null,null,null,null,null,null,null,null,null,null,null,null,null,null,null,null,null,{"$f":"#REF!","v":{"$error":"#REF!"}}]
[null,null,null,null,null,null,null,null,null,null,null,null,null,null,null,null,null,null,null,null,null,{"$f":"#REF!","v":{"$error":"#REF!"}}]
[null,null,null,null,null,null,null,null,null,null,null,null,null,null,null,null,null,null,null,null,null,{"$f":"#REF!","v":{"$error":"#REF!"}}]
[null,null,null,null,null,null,null,null,null,null,null,null,null,null,null,null,null,null,null,null,null,{"$f":"#REF!","v":{"$error":"#REF!"}}]
[null,null,null,null,null,null,null,null,null,null,null,null,null,null,null,null,null,null,null,null,null,{"$f":"#REF!","v":{"$error":"#REF!"}}]
[null,null,null,null,null,null,null,null,null,null,null,null,null,null,null,null,null,null,null,null,null,{"$f":"#REF!","v":{"$error":"#REF!"}}]
[null,null,null,null,null,null,null,null,null,null,null,null,null,null,null,null,null,null,null,null,null,{"$f":"#REF!","v":{"$error":"#REF!"}}]
[null,null,null,null,null,null,null,null,null,null,null,null,null,null,null,null,null,null,null,null,null,{"$f":"#REF!","v":{"$error":"#REF!"}}]
[null,null,null,null,null,null,null,null,null,null,null,null,null,null,null,null,null,null,null,null,null,{"$f":"#REF!","v":{"$error":"#REF!"}}]
[null,null,null,null,null,null,null,null,null,null,null,null,null,null,null,null,null,null,null,null,null,{"$f":"#REF!","v":{"$error":"#REF!"}}]
[null,null,null,null,null,null,null,null,null,null,null,null,null,null,null,null,null,null,null,null,null,{"$f":"#REF!","v":{"$error":"#REF!"}}]
[null,null,null,null,null,null,null,null,null,null,null,null,null,null,null,null,null,null,null,null,null,{"$f":"#REF!","v":{"$error":"#REF!"}}]
[null,null,null,null,null,null,null,null,null,null,null,null,null,null,null,null,null,null,null,null,null,{"$f":"#REF!","v":{"$error":"#REF!"}}]
[null,null,null,null,null,null,null,null,null,null,null,null,null,null,null,null,null,null,null,null,null,{"$f":"#REF!","v":{"$error":"#REF!"}}]
[null,null,null,null,null,null,null,null,null,null,null,null,null,null,null,null,null,null,null,null,null,{"$f":"#REF!","v":{"$error":"#REF!"}}]
[null,null,null,null,null,null,null,null,null,null,null,null,null,null,null,null,null,null,null,null,null,{"$f":"#REF!","v":{"$error":"#REF!"}}]
[null,null,null,null,null,null,null,null,null,null,null,null,null,null,null,null,null,null,null,null,null,{"$f":"#REF!","v":{"$error":"#REF!"}}]
[null,null,null,null,null,null,null,null,null,null,null,null,null,null,null,null,null,null,null,null,null,{"$f":"#REF!","v":{"$error":"#REF!"}}]
[null,null,null,null,null,null,null,null,null,null,null,null,null,null,null,null,null,null,null,null,null,{"$f":"#REF!","v":{"$error":"#REF!"}}]
[null,null,null,null,null,null,null,null,null,null,null,null,null,null,null,null,null,null,null,null,null,{"$f":"#REF!","v":{"$error":"#REF!"}}]
[null,null,null,null,null,null,null,null,null,null,null,null,null,null,null,null,null,null,null,null,null,{"$f":"#REF!","v":{"$error":"#REF!"}}]
[null,null,null,null,null,null,null,null,null,null,null,null,null,null,null,null,null,null,null,null,null,{"$f":"#REF!","v":{"$error":"#REF!"}}]
[null,null,null,null,null,null,null,null,null,null,null,null,null,null,null,null,null,null,null,null,null,{"$f":"#REF!","v":{"$error":"#REF!"}}]
[null,null,null,null,null,null,null,null,null,null,null,null,null,null,null,null,null,null,null,null,null,{"$f":"#REF!","v":{"$error":"#REF!"}}]
[null,null,null,null,null,null,null,null,null,null,null,null,null,null,null,null,null,null,null,null,null,{"$f":"#REF!","v":{"$error":"#REF!"}}]
[null,null,null,null,null,null,null,null,null,null,null,null,null,null,null,null,null,null,null,null,null,{"$f":"#REF!","v":{"$error":"#REF!"}}]
[null,null,null,null,null,null,null,null,null,null,null,null,null,null,null,null,null,null,null,null,null,{"$f":"#REF!","v":{"$error":"#REF!"}}]
[null,null,null,null,null,null,null,null,null,null,null,null,null,null,null,null,null,null,null,null,null,{"$f":"#REF!","v":{"$error":"#REF!"}}]
[null,null,null,null,null,null,null,null,null,null,null,null,null,null,null,null,null,null,null,null,null,{"$f":"#REF!","v":{"$error":"#REF!"}}]

{"sheet":"Résultats","index":15,"n_rows":0,"n_cols":0,"rows_kept":0,"cut":false,"hidden":true,"merged":[]}

{"sheet":"Coupe Berthelette","index":16,"n_rows":56,"n_cols":18,"rows_kept":56,"cut":false,"hidden":true,"merged":[[0,0,0,9],[1,4,1,8],[2,0,2,3],[2,4,2,8],[3,4,3,8]]}
["Coupe Claude Berthelette"]
[null,null,null,null,"DOJO",null,null,null,null,"Points"]
["Décerné à :",null,null,null,{"$f":"IF(L5>1,\"Plus de un gagnant\",VLOOKUP(J3,E6:F51,2,0))","v":"Plus de un gagnant"},null,null,null,null,{"$f":"MAX(E6:E52)","v":{"$error":"#REF!"}}]
[]
[null,"Participants (X1)","Arbitre (X5, Max 10)","Victoires","Total Points","Dojo",null,null,null,null,null,{"$f":"COUNTIF(E6:E51,J3)","v":46}]
[null,{"$f":"COUNTIF(#REF!,F6)","v":{"$error":"#REF!"}},{"$f":"IF(L6=1,5,IF(L6>1,10,0))","v":0},null,{"$f":"SUM(B6:D6)","v":{"$error":"#REF!"}},{"$f":"#REF!","v":{"$error":"#REF!"}},null,null,null,null,null,{"$f":"COUNTIF($Q$6:$Q$26,F6)","v":0},null,null,null,null,{"$f":"IF(Arbitre!A2>0,Arbitre!C2,0)","v":"Hakudo Kan"},{"$f":"IF(Q6>0,1,\"\")","v":1}]
[null,{"$f":"COUNTIF(#REF!,F7)","v":{"$error":"#REF!"}},0,null,{"$error":"#REF!"},{"$f":"#REF!","v":{"$error":"#REF!"}},null,null,null,null,null,0,null,null,null,null,{"$f":"IF(Arbitre!A3>0,Arbitre!C3,0)","v":"Fujiyama"},1]
[null,{"$f":"COUNTIF(#REF!,F8)","v":{"$error":"#REF!"}},0,null,{"$error":"#REF!"},{"$f":"#REF!","v":{"$error":"#REF!"}},null,null,null,null,null,0,null,null,null,null,{"$f":"IF(Arbitre!A4>0,Arbitre!C4,0)","v":"Hakudo Kan"},1]
[null,{"$f":"COUNTIF(#REF!,F9)","v":{"$error":"#REF!"}},0,null,{"$error":"#REF!"},{"$f":"#REF!","v":{"$error":"#REF!"}},null,null,null,null,null,0,null,null,null,null,{"$f":"IF(Arbitre!A5>0,Arbitre!C5,0)","v":"Chateauguay"},1]
[null,{"$f":"COUNTIF(#REF!,F10)","v":{"$error":"#REF!"}},0,null,{"$error":"#REF!"},{"$f":"#REF!","v":{"$error":"#REF!"}},null,null,null,null,null,0,null,null,null,null,{"$f":"IF(Arbitre!A6>0,Arbitre!C6,0)","v":"Fujiyama"},1]
[null,{"$f":"COUNTIF(#REF!,F11)","v":{"$error":"#REF!"}},0,null,{"$error":"#REF!"},{"$f":"#REF!","v":{"$error":"#REF!"}},null,null,null,null,null,0,null,null,null,null,{"$f":"IF(Arbitre!A7>0,Arbitre!C7,0)","v":"Beloeil"},1]
[null,{"$f":"COUNTIF(#REF!,F12)","v":{"$error":"#REF!"}},0,null,{"$error":"#REF!"},{"$f":"#REF!","v":{"$error":"#REF!"}},null,null,null,null,null,0,null,null,null,null,{"$f":"IF(Arbitre!A8>0,Arbitre!C8,0)","v":"Boucherville"},1]
[null,{"$f":"COUNTIF(#REF!,F13)","v":{"$error":"#REF!"}},0,null,{"$error":"#REF!"},{"$f":"#REF!","v":{"$error":"#REF!"}},null,null,null,null,null,0,null,null,null,null,{"$f":"IF(Arbitre!A9>0,Arbitre!C9,0)","v":"CEMCUM"},1]
[null,{"$f":"COUNTIF(#REF!,F14)","v":{"$error":"#REF!"}},0,null,{"$error":"#REF!"},{"$f":"#REF!","v":{"$error":"#REF!"}},null,null,null,null,null,0,null,null,null,null,{"$f":"IF(Arbitre!A10>0,Arbitre!C10,0)","v":"Boucherville"},1]
[null,{"$f":"COUNTIF(#REF!,F15)","v":{"$error":"#REF!"}},0,null,{"$error":"#REF!"},{"$f":"#REF!","v":{"$error":"#REF!"}},null,null,null,null,null,0,null,null,null,null,{"$f":"IF(Arbitre!A11>0,Arbitre!C11,0)","v":"St-Hubert"},{"$f":"IF(Q15>0,1,\" \")","v":1}]
[null,{"$f":"COUNTIF(#REF!,F16)","v":{"$error":"#REF!"}},0,null,{"$error":"#REF!"},{"$f":"#REF!","v":{"$error":"#REF!"}},null,null,null,null,null,0,null,null,null,null,{"$f":"IF(Arbitre!A12>0,Arbitre!C12,0)","v":"Albatros"},{"$f":"IF(Q16>0,1,\"\")","v":1}]
[null,{"$f":"COUNTIF(#REF!,F17)","v":{"$error":"#REF!"}},0,null,{"$error":"#REF!"},{"$f":"#REF!","v":{"$error":"#REF!"}},null,null,null,null,null,0,null,null,null,null,{"$f":"IF(Arbitre!A13>0,Arbitre!C13,0)","v":"Zyx"},1]
[null,{"$f":"COUNTIF(#REF!,F18)","v":{"$error":"#REF!"}},0,null,{"$error":"#REF!"},{"$f":"#REF!","v":{"$error":"#REF!"}},null,null,null,null,null,0,null,null,null,null,{"$f":"IF(Arbitre!A14>0,Arbitre!C14,0)","v":0},""]
[null,{"$f":"COUNTIF(#REF!,F19)","v":{"$error":"#REF!"}},0,null,{"$error":"#REF!"},{"$f":"#REF!","v":{"$error":"#REF!"}},null,null,null,null,null,0,null,null,null,null,{"$f":"IF(Arbitre!A15>0,Arbitre!C15,0)","v":0},""]
[null,{"$f":"COUNTIF(#REF!,F20)","v":{"$error":"#REF!"}},0,null,{"$error":"#REF!"},{"$f":"#REF!","v":{"$error":"#REF!"}},null,null,null,null,null,0,null,null,null,null,{"$f":"IF(Arbitre!A16>0,Arbitre!C16,0)","v":0},""]
[null,{"$f":"COUNTIF(#REF!,F21)","v":{"$error":"#REF!"}},0,null,{"$error":"#REF!"},{"$f":"#REF!","v":{"$error":"#REF!"}},null,null,null,null,null,0,null,null,null,null,{"$f":"IF(Arbitre!A17>0,Arbitre!C17,0)","v":0},""]
[null,{"$f":"COUNTIF(#REF!,F22)","v":{"$error":"#REF!"}},0,null,{"$error":"#REF!"},{"$f":"#REF!","v":{"$error":"#REF!"}},null,null,null,null,null,0,null,null,null,null,{"$f":"IF(Arbitre!A18>0,Arbitre!C18,0)","v":0},""]
[null,{"$f":"COUNTIF(#REF!,F23)","v":{"$error":"#REF!"}},0,null,{"$error":"#REF!"},{"$f":"#REF!","v":{"$error":"#REF!"}},null,null,null,null,null,0,null,null,null,null,{"$f":"IF(Arbitre!A19>0,Arbitre!C19,0)","v":0},""]
[null,{"$f":"COUNTIF(#REF!,F24)","v":{"$error":"#REF!"}},0,null,{"$error":"#REF!"},{"$f":"#REF!","v":{"$error":"#REF!"}},null,null,null,null,null,0,null,null,null,null,{"$f":"IF(Arbitre!A20>0,Arbitre!C20,0)","v":0},""]
[null,{"$f":"COUNTIF(#REF!,F25)","v":{"$error":"#REF!"}},0,null,{"$error":"#REF!"},{"$f":"#REF!","v":{"$error":"#REF!"}},null,null,null,null,null,0,null,null,null,null,{"$f":"IF(Arbitre!A21>0,Arbitre!C21,0)","v":0},""]
[null,{"$f":"COUNTIF(#REF!,F26)","v":{"$error":"#REF!"}},0,null,{"$error":"#REF!"},{"$f":"#REF!","v":{"$error":"#REF!"}},null,null,null,null,null,0,null,null,null,null,{"$f":"IF(Arbitre!A22>0,Arbitre!C22,0)","v":0},""]
[null,{"$f":"COUNTIF(#REF!,F27)","v":{"$error":"#REF!"}},0,null,{"$error":"#REF!"},{"$f":"#REF!","v":{"$error":"#REF!"}},null,null,null,null,null,0,null,null,null,null,{"$f":"IF(Arbitre!A23>0,Arbitre!C23,0)","v":0},{"$f":"IF(Q27>0,1,0)","v":0}]
[null,{"$f":"COUNTIF(#REF!,F28)","v":{"$error":"#REF!"}},0,null,{"$error":"#REF!"},{"$f":"#REF!","v":{"$error":"#REF!"}},null,null,null,null,null,0,null,null,null,null,{"$f":"IF(Arbitre!A24>0,Arbitre!C24,0)","v":0},0]
[null,{"$f":"COUNTIF(#REF!,F29)","v":{"$error":"#REF!"}},0,null,{"$error":"#REF!"},{"$f":"#REF!","v":{"$error":"#REF!"}},null,null,null,null,null,0,null,null,null,null,{"$f":"IF(Arbitre!A25>0,Arbitre!C25,0)","v":0},0]
[null,{"$f":"COUNTIF(#REF!,F30)","v":{"$error":"#REF!"}},0,50,{"$error":"#REF!"},{"$f":"#REF!","v":{"$error":"#REF!"}},null,null,null,null,null,0,null,null,null,null,{"$f":"IF(Arbitre!A26>0,Arbitre!C26,0)","v":0},0]
[null,{"$f":"COUNTIF(#REF!,F31)","v":{"$error":"#REF!"}},0,null,{"$error":"#REF!"},{"$f":"#REF!","v":{"$error":"#REF!"}},null,null,null,null,null,0,null,null,null,null,{"$f":"IF(Arbitre!A27>0,Arbitre!C27,0)","v":0},0]
[null,{"$f":"COUNTIF(#REF!,F32)","v":{"$error":"#REF!"}},0,null,{"$error":"#REF!"},{"$f":"#REF!","v":{"$error":"#REF!"}},null,null,null,null,null,0,null,null,null,null,{"$f":"IF(Arbitre!A28>0,Arbitre!C28,0)","v":0},0]
[null,{"$f":"COUNTIF(#REF!,F33)","v":{"$error":"#REF!"}},0,null,{"$error":"#REF!"},{"$f":"#REF!","v":{"$error":"#REF!"}},null,null,null,null,null,0,null,null,null,null,{"$f":"IF(Arbitre!A29>0,Arbitre!C29,0)","v":0},0]
[null,{"$f":"COUNTIF(#REF!,F34)","v":{"$error":"#REF!"}},0,null,{"$error":"#REF!"},{"$f":"#REF!","v":{"$error":"#REF!"}},null,null,null,null,null,0,null,null,null,null,{"$f":"IF(Arbitre!A30>0,Arbitre!C30,0)","v":0},0]
[null,{"$f":"COUNTIF(#REF!,F35)","v":{"$error":"#REF!"}},0,null,{"$error":"#REF!"},{"$f":"#REF!","v":{"$error":"#REF!"}},null,null,null,null,null,0,null,null,null,null,{"$f":"IF(Arbitre!A31>0,Arbitre!C31,0)","v":0},0]
[null,{"$f":"COUNTIF(#REF!,F36)","v":{"$error":"#REF!"}},0,null,{"$error":"#REF!"},{"$f":"#REF!","v":{"$error":"#REF!"}},null,null,null,null,null,0,null,null,null,null,{"$f":"IF(Arbitre!A32>0,Arbitre!C32,0)","v":0},0]
[null,{"$f":"COUNTIF(#REF!,F37)","v":{"$error":"#REF!"}},0,null,{"$error":"#REF!"},{"$f":"#REF!","v":{"$error":"#REF!"}},null,null,null,null,null,0,null,null,null,null,{"$f":"IF(Arbitre!A33>0,Arbitre!C33,0)","v":0},0]
[null,{"$f":"COUNTIF(#REF!,F38)","v":{"$error":"#REF!"}},0,null,{"$error":"#REF!"},{"$f":"#REF!","v":{"$error":"#REF!"}},null,null,null,null,null,0,null,null,null,null,{"$f":"IF(Arbitre!A34>0,Arbitre!C34,0)","v":0},0]
[null,{"$f":"COUNTIF(#REF!,F39)","v":{"$error":"#REF!"}},0,null,{"$error":"#REF!"},{"$f":"#REF!","v":{"$error":"#REF!"}},null,null,null,null,null,0,null,null,null,null,{"$f":"IF(Arbitre!A35>0,Arbitre!C35,0)","v":0},0]
[null,{"$f":"COUNTIF(#REF!,F40)","v":{"$error":"#REF!"}},0,null,{"$error":"#REF!"},{"$f":"#REF!","v":{"$error":"#REF!"}},null,null,null,null,null,0,null,null,null,null,{"$f":"IF(Arbitre!A36>0,Arbitre!C36,0)","v":0},0]
[null,{"$f":"COUNTIF(#REF!,F41)","v":{"$error":"#REF!"}},0,null,{"$error":"#REF!"},{"$f":"#REF!","v":{"$error":"#REF!"}},null,null,null,null,null,0,null,null,null,null,{"$f":"IF(Arbitre!A37>0,Arbitre!C37,0)","v":0},0]
[null,{"$f":"COUNTIF(#REF!,F42)","v":{"$error":"#REF!"}},0,null,{"$error":"#REF!"},{"$f":"#REF!","v":{"$error":"#REF!"}},null,null,null,null,null,0,null,null,null,null,{"$f":"IF(Arbitre!A38>0,Arbitre!C38,0)","v":0},0]
[null,{"$f":"COUNTIF(#REF!,F43)","v":{"$error":"#REF!"}},0,null,{"$error":"#REF!"},{"$f":"#REF!","v":{"$error":"#REF!"}},null,null,null,null,null,0,null,null,null,null,{"$f":"IF(Arbitre!A39>0,Arbitre!C39,0)","v":0},0]
[null,{"$f":"COUNTIF(#REF!,F44)","v":{"$error":"#REF!"}},0,null,{"$error":"#REF!"},{"$f":"#REF!","v":{"$error":"#REF!"}},null,null,null,null,null,0,null,null,null,null,{"$f":"IF(Arbitre!A40>0,Arbitre!C40,0)","v":0},0]
[null,{"$f":"COUNTIF(#REF!,F45)","v":{"$error":"#REF!"}},0,null,{"$error":"#REF!"},{"$f":"#REF!","v":{"$error":"#REF!"}},null,null,null,null,null,0,null,null,null,null,{"$f":"IF(Arbitre!A41>0,Arbitre!C41,0)","v":0},0]
[null,{"$f":"COUNTIF(#REF!,F46)","v":{"$error":"#REF!"}},0,null,{"$error":"#REF!"},{"$f":"#REF!","v":{"$error":"#REF!"}},null,null,null,null,null,0,null,null,null,null,{"$f":"IF(Arbitre!A42>0,Arbitre!C42,0)","v":0},0]
[null,{"$f":"COUNTIF(#REF!,F47)","v":{"$error":"#REF!"}},0,null,{"$error":"#REF!"},{"$f":"#REF!","v":{"$error":"#REF!"}},null,null,null,null,null,0,null,null,null,null,{"$f":"IF(Arbitre!A43>0,Arbitre!C43,0)","v":0},0]
[null,{"$f":"COUNTIF(#REF!,F48)","v":{"$error":"#REF!"}},0,null,{"$error":"#REF!"},{"$f":"#REF!","v":{"$error":"#REF!"}},null,null,null,null,null,0,null,null,null,null,{"$f":"IF(Arbitre!A44>0,Arbitre!C44,0)","v":0},0]
[null,{"$f":"COUNTIF(#REF!,F49)","v":{"$error":"#REF!"}},0,null,{"$error":"#REF!"},{"$f":"#REF!","v":{"$error":"#REF!"}},null,null,null,null,null,0,null,null,null,null,{"$f":"IF(Arbitre!A45>0,Arbitre!C45,0)","v":0},0]
[null,{"$f":"COUNTIF(#REF!,F50)","v":{"$error":"#REF!"}},0,null,{"$error":"#REF!"},{"$f":"#REF!","v":{"$error":"#REF!"}},null,null,null,null,null,0,null,null,null,null,{"$f":"IF(Arbitre!A46>0,Arbitre!C46,0)","v":0},0]
[null,{"$f":"COUNTIF(#REF!,F51)","v":{"$error":"#REF!"}},0,null,{"$error":"#REF!"},{"$f":"#REF!","v":{"$error":"#REF!"}},null,null,null,null,null,0,null,null,null,null,{"$f":"IF(Arbitre!A47>0,Arbitre!C47,0)","v":0},0]
[null,null,null,null,null,null,null,null,null,null,{"$f":"IF(Arbitre!A48>0,Arbitre!C48,0)","v":0},{"$f":"IF(K52>0,1,0)","v":0}]
[null,null,null,null,null,null,null,null,null,null,{"$f":"IF(Arbitre!A49>0,Arbitre!C49,0)","v":0},{"$f":"IF(K53>0,1,0)","v":0}]
[null,null,null,null,null,null,null,null,null,null,{"$f":"IF(Arbitre!A50>0,Arbitre!C50,0)","v":0},{"$f":"IF(K54>0,1,0)","v":0}]
[null,null,null,null,null,null,null,null,null,null,{"$f":"IF(Arbitre!A51>0,Arbitre!C51,0)","v":0},{"$f":"IF(K55>0,1,0)","v":0}]
[null,null,null,null,null,null,null,null,null,null,{"$f":"IF(Arbitre!A52>0,Arbitre!C52,0)","v":0},{"$f":"IF(K56>0,1,0)","v":0}]

{"sheet":"Trophé du Millénaire","index":17,"n_rows":0,"n_cols":0,"rows_kept":0,"cut":false,"hidden":true,"merged":[]}